{"text_format":"1","workbook":"xlsx","n_sheets":11,"sheets":["ReadMe","temp","LTG-SUM","LTG-INT-SPACE","LTG-INT-DISPLAY","LTG-INT-BLD","LTG-INT-REF","LTG-EXT","LTG-EXT-REF","LTG-LPA","LTG-CHK"],"not_rendered":{"charts":0,"images":0,"macros":1,"external_links":0,"defined_names":52,"comments":0,"pivot_tables":0},"unopened":[],"bounds":{"document_bytes":16777216,"sheet_cells":100000,"rows_first":2000,"rows_last":500,"rows_between":2000,"halvings":0,"cell_chars":16384,"cell_head_chars":4096},"cells_cut":0,"cells_raw":0,"read":"whole","date_system":"1900"}

{"sheet":"ReadMe","index":0,"n_rows":48,"n_cols":2,"rows_kept":48,"cut":false,"hidden":false,"merged":[[1,0,1,1],[5,0,6,0],[9,0,10,0],[13,0,19,0],[47,0,47,1],[28,0,28,1],[39,0,40,0],[41,0,44,0],[45,0,46,0],[36,0,38,0],[33,0,35,0],[30,0,32,0],[21,0,23,0]]}
["Instructions for Electronic Forms, pg 1"]
["2012 Washington State Energy Code Compliance Forms for Commercial Buildings including R2 & R3 over 3 stories and all R1 "]
[null,"Revised Jan 2014"]
[null,"     Commercial Provision Chapters 1 - 5 of the 2012 Washington State Energy Code apply to all commercial occupancies, R-2 and R-3 occupancies greater than 3 stories above grade, and R-1 occupancy (all building heights)."]
["Intro","     This file, LTG12-v3.XLSM, has electronic compliance forms for electrical power and lighting system provisions as defined in Section C405. This includes interior and exterior lighting systems, electric motors, and transformers. There are two companion files: ENV12-v3.XLSM (Sections C101, C303, C402 and Appendix A envelope requirements) and MECH12-v3.XLSM (Section C403 mechanical systems requirements). "]
["Energy Code ","    This form is a compliance aid and is not a substitute for the full energy code text or specific jurisdiction compliance requirements. Users should refer to the code text and contact the local jurisdiction for complete information. The full 2012 WSEC code text is available for download from the NEEC website:"]
[null,"http:/www.neec.net/energy-codes"]
["Training ","Refer to the NEEC website for instruction on how to complete all of the 2012 WSEC Compliance Forms."]
["Start-up","Select this file from the NEEC website to download to your computer. When opening the file be sure to Enable Macros. "]
["Overview ","     This file is an Excel workbook that contains multiple compliance forms and resources in Excel worksheets. Each worksheet is indicated by a tab at the bottom of the screen. You may visit each worksheet by selecting it's tab. "]
{"$rows_left_out":39}
{"sheet":"temp","index":1,"n_rows":35,"n_cols":1,"rows_kept":35,"cut":false,"hidden":true,"merged":[]}
[4]
[4]
[4]
[4]
[4]
[4]
[4]
[4]
[4]
[4]
{"$rows_left_out":26}
{"sheet":"LTG-SUM","index":2,"n_rows":38,"n_cols":7,"rows_kept":38,"cut":false,"hidden":false,"merged":[[11,0,11,1],[13,0,13,1],[15,2,19,6],[34,2,34,6],[36,2,36,6],[35,0,35,6],[33,0,33,6],[29,2,29,6],[31,2,31,6],[32,2,32,6],[38,2,38,6],[22,0,22,6],[23,0,23,6],[24,0,24,6],[28,0,28,6],[37,0,37,6],[30,0,30,6]]}
["Interior Lighting Summary",null,null,null,null,null,"LTG-SUM"]
[{"$f":"ReadMe!A2","v":"2012 Washington State Energy Code Compliance Forms for Commercial Buildings including R2 & R3 over 3 stories and all R1 "},null,null,null,null,null,{"$f":"ReadMe!B3","v":"Revised Jan 2014"}]
["Project Info","Project Address","1 - This address line will copy onto other forms",null,null,"Date","2013-05-21"]
[null,null,"2 - This address line will copy onto other forms",null,null,"For Building Department Use"]
[null,null,"3 - This address line will copy onto other forms"]
[null,"Applicant Name:","4 - This address line will copy onto other forms"]
[null,"Applicant Address:"]
[null,"Applicant Phone:"]
[]
["Project Description",null,null,null,null,false]
{"$rows_left_out":29}
{"sheet":"LTG-INT-SPACE","index":3,"n_rows":181,"n_cols":5,"rows_kept":181,"cut":false,"hidden":false,"merged":[[19,0,19,4],[37,9,40,9],[5,0,5,2]]}
["Interior Lighting Summary - Space-By-Space ",null,null,null,"LTG-INT-SPACE"]
[{"$f":"'LTG-SUM'!A2","v":"2012 Washington State Energy Code Compliance Forms for Commercial Buildings including R2 & R3 over 3 stories and all R1 "},null,null,null,{"$f":"'LTG-SUM'!G2","v":"Revised Jan 2014"}]
["Project Address",{"$f":"IF('LTG-SUM'!C3=\"1 - This address line will copy onto other forms\",\"Fill this line out on LGT-SUM\",'LTG-SUM'!C3)","v":"Fill this line out on LGT-SUM"},null,{"$f":"'LTG-SUM'!F3","v":"Date"},{"$f":"'LTG-SUM'!G3","v":"2013-05-21"}]
["Lighting Alterations, Renovations & Building Additions",null,null,{"$f":"'LTG-SUM'!F4","v":"For Building Department Use"}]
[]
[]
[]
[{"$f":"IF(Path=2,\"Total Building Performance - No lighting calcs required\",IF(RenAltAdd=1,\"Maximum Allowed Lighting Wattage\",IF(Method=3,\"Specify Compliance Method on LGT-SUM\",IF(Method=2,\"Maximum Allowed Lighting Wattage\",\"Building Area Method selected. Use LTG-INT-BLD form.\"))))","v":"Specify Compliance Method on LGT-SUM"}]
["Location (plan #,\n room #)","Space Type*","Allowed\nWatts per ft2","Gross Interior \nArea in ft2","Watts Allowed\n(watts/ft2 x area)"]
[null,null,{"$f":"IF(B10=\"\",0,VLOOKUP(B10,$D$93:$E$181,2,FALSE))","v":0},null,{"$f":"IF(RenAltAdd=1,0,C10*D10)","v":0}]
{"$rows_left_out":172}
{"sheet":"LTG-INT-DISPLAY","index":4,"n_rows":112,"n_cols":11,"rows_kept":112,"cut":false,"hidden":false,"merged":[[8,1,8,2],[43,9,45,9],[20,0,20,5],[13,1,13,2],[9,1,9,2],[10,1,10,2],[11,1,11,2],[12,1,12,2]]}
["Interior Display Lighting - Space-by-Space ",null,null,null,null,"LTG-INT-DISPLAY"]
[{"$f":"'LTG-SUM'!A2","v":"2012 Washington State Energy Code Compliance Forms for Commercial Buildings including R2 & R3 over 3 stories and all R1 "},null,null,null,null,{"$f":"'LTG-SUM'!G2","v":"Revised Jan 2014"}]
[{"$f":"'LTG-SUM'!A3","v":"Project Info"},{"$f":"'LTG-SUM'!B3","v":"Project Address"},{"$f":"IF('LTG-SUM'!C3=\"1 - This address line will copy onto other forms\",\"Fill this line out on LGT-SUM\",'LTG-SUM'!C3)","v":"Fill this line out on LGT-SUM"},null,{"$f":"'LTG-SUM'!F3","v":"Date"},{"$f":"'LTG-SUM'!G3","v":"2013-05-21"}]
[null,{"$f":"'LTG-SUM'!B4","v":0},{"$f":"IF('LTG-SUM'!C4=\"2 - This address line will copy onto other forms\",\"Fill this line out on LGT-SUM\",'LTG-SUM'!C4)","v":"Fill this line out on LGT-SUM"},null,{"$f":"'LTG-SUM'!F4","v":"For Building Department Use"}]
[null,{"$f":"'LTG-SUM'!B5","v":0},{"$f":"IF('LTG-SUM'!C5=\"3 - This address line will copy onto other forms\",\"Fill this line out on LGT-SUM\",'LTG-SUM'!C5)","v":"Fill this line out on LGT-SUM"}]
[null,{"$f":"'LTG-SUM'!B6","v":"Applicant Name:"},{"$f":"IF('LTG-SUM'!C6=\"4 - This address line will copy onto other forms\",\"Fill this line out on LGT-SUM\",'LTG-SUM'!C6)","v":"Fill this line out on LGT-SUM"}]
[]
[{"$f":"IF(Path=2,\"Total Building Performance - No lighting calcs required\",IF(Method=3,\"Specify Compliance Method on LGT-SUM\",IF(Method=2,\"Maximum Allowed Display Lighting Wattage\",\"Building Area Method selected. Use LTG-INT-BLD form.\")))","v":"Specify Compliance Method on LGT-SUM"}]
["Location (plan #,\n room #)","Retail Display Area Type*",null,"Allowed\nWatts per ft2 **","Gross Interior \nArea in ft2","Watts Allowed\n(watts/ft2 x area)"]
[null,null,null,{"$f":"IF(B10=\"\",0,VLOOKUP(B10,$E$100:$F$103,2,FALSE))","v":0},null,{"$f":"IF(B10=\"\",\"\",IF(ISNA(IF(VLOOKUP(VLOOKUP(B10,$E$100:$G$103,3,FALSE),$A$23:$F$36,6,0)>0,\"\",NA())),\"No display\",D10*E10))","v":""},{"$f":"IF(ISNA(INDEX(B$10:B$15,MATCH(0,COUNTIF(G$9:$G9,B$10:B$15),0))),\"\",INDEX(B$10:B$15,MATCH(0,COUNTIF(G$9:$G9,B$10:B$15),0)))","v":0}]
{"$rows_left_out":103}
{"sheet":"LTG-INT-BLD","index":5,"n_rows":116,"n_cols":10,"rows_kept":116,"cut":false,"hidden":false,"merged":[[34,1,34,2],[16,2,16,5],[35,1,35,2],[36,1,36,2],[3,0,3,3],[4,0,4,3],[5,0,5,3],[32,1,32,2],[33,1,33,2]]}
["Interior Lighting Summary - Building Area Method",null,null,null,null,"LTG-INT-BLD"]
[{"$f":"'LTG-SUM'!A2","v":"2012 Washington State Energy Code Compliance Forms for Commercial Buildings including R2 & R3 over 3 stories and all R1 "},null,null,null,null,{"$f":"'LTG-SUM'!G2","v":"Revised Jan 2014"}]
[{"$f":"'LTG-SUM'!B3","v":"Project Address"},{"$f":"IF('LTG-SUM'!C3=\"1 - This address line will copy onto other forms\",\"Fill this line out on LGT-SUM\",'LTG-SUM'!C3)","v":"Fill this line out on LGT-SUM"},null,null,{"$f":"'LTG-SUM'!F3","v":"Date"},{"$f":"'LTG-SUM'!G3","v":"2013-05-21"}]
["Lighting Alterations, Renovations & Building Additions",null,null,null,{"$f":"'LTG-SUM'!F4","v":"For Building Department Use"}]
[]
[]
[]
[{"$f":"IF(Path=2,\"Total Building Performance - No lighting calcs required\",IF(RenAltAdd=1,\"Use LTG-INT-SPACE form for less than 60% lighting retrofit.\",IF(Method=3,\"Specify Compliance Method on LGT-SUM\",IF(Method=1,\"Maximum Allowed Lighting Wattage\",\"Space-By-Space method selected. Use LTG-INT-SPACE form.\"))))","v":"Specify Compliance Method on LGT-SUM"}]
["Building Area*","Location (plan #,\n room #, or ALL)","Area Description","Allowed\nWatts per ft2","Gross Interior \nArea in ft2","Watts Allowed\n(watts/ft2 x area)"]
[null,null,null,{"$f":"IF(A10=\"\",0,VLOOKUP(A10,$A$84:$B$116,2,FALSE))","v":0},null,{"$f":"IF(AND(A10=\"\",D10=0,E10=0),0,IF(ISNA(IF(VLOOKUP(A10,$A$20:$F$31,6,FALSE)>0,\"\",NA())),\"Unlit\",D10*E10))","v":0},{"$f":"IF(ISNA(INDEX(A$10:A$15,MATCH(0,COUNTIF(G$9:$G9,A$10:A$15),0))),\"\",INDEX(A$10:A$15,MATCH(0,COUNTIF(G$9:$G9,A$10:A$15),0)))","v":0}]
{"$rows_left_out":107}
{"sheet":"LTG-INT-REF","index":6,"n_rows":81,"n_cols":17,"rows_kept":81,"cut":false,"hidden":true,"merged":[[9,8,9,11]]}
["Renovation path"]
[5]
["Path"]
[3,"(1=lighting power, 2=Total Building Performance, 3=not specified",null,null,null,null,null,null,null,{"$f":"SUMPRODUCT('LTG-INT-BLD'!D20:D30,'LTG-INT-BLD'!E20:E30)","v":0},"watts entered"]
["Method",null,null,null,null,null,null,null,null,{"$f":"SUM(J12:J32)","v":0},"watts in allowed catagories"]
[3,"(1=building area, 2=space-by-space, 3=not specified",null,null,null,null,null,"Number of Unique Areas"]
["Pass",null,null,null,null,null,null,{"$f":"21-COUNTIF(G12:G32,NA())","v":0}]
[{"$f":"IF(Method=1,SUM(L12:L32)=0,TRUE)","v":true},{"$f":"IF(A8=FALSE,MID(E8,1,LEN(E8)-2),IF(SUM(J12:J47)>0,IF(Method=1,IF(J4=J5,\"ALL AREAS COMPLY\",\"PROPOSED LIGHTING IN UNDEFINED SPACE TYPE\"),\"SPECIFY COMPLIANCE METHOD ON LGT-SUM\"),\"\"))","v":""},null,null,{"$f":"IF(A8=FALSE,\"The following areas do not comply: \",\"\")","v":""},null,null,null,{"$f":"IF(J8=\"\",,IF(MID(J8,LEN(J8)-1,2)=\", \",MID(J8,1,LEN(J8)-2),J8))","v":0},{"$f":"IF(A8=FALSE,CONCATENATE(P12,P13,P14,P15,P16,P17,P18,P19,P20,P21,P22,P23,P24,P25,P26,P27,P28,P29,P30,P31,P32),\"\")","v":""}]
["Low LPD",null,null,null,null,null,null,"Specified Building Areas"]
[{"$f":"SUM(O12:O32)>0","v":false},{"$f":"IF(A10=TRUE,\"Areas with low LPD's.  Check that all proposed fixtures are entered:\",\"\")","v":""},null,null,{"$f":"IF(A10=TRUE,CONCATENATE(Q12,Q13,Q14,Q15,Q16,Q17,Q18,Q19,Q20,Q21,Q22,Q23,Q24,Q25,Q26,Q27,Q28,Q29,Q30,Q31,Q32),\"\")","v":""},null,null,null,"Watts",null,null,null,"Area"]
{"$rows_left_out":72}
{"sheet":"LTG-EXT","index":7,"n_rows":168,"n_cols":12,"rows_kept":168,"cut":false,"hidden":false,"merged":[[11,0,11,1],[18,2,18,4],[19,2,19,4],[17,0,19,1]]}
["Exterior Lighting Summary",null,null,null,"LTG-EXT"]
[{"$f":"'LTG-SUM'!A2","v":"2012 Washington State Energy Code Compliance Forms for Commercial Buildings including R2 & R3 over 3 stories and all R1 "},null,null,null,{"$f":"'LTG-SUM'!G2","v":"Revised Jan 2014"}]
[{"$f":"'LTG-SUM'!A3","v":"Project Info"},{"$f":"IF('LTG-SUM'!C3=\"1 - This address line will copy onto other forms\",\"Fill this line out on LGT-SUM\",'LTG-SUM'!C3)","v":"Fill this line out on LGT-SUM"},null,{"$f":"'LTG-SUM'!F3","v":"Date"},{"$f":"'LTG-SUM'!G3","v":"2013-05-21"}]
[null,{"$f":"IF('LTG-SUM'!C4=\"2 - This address line will copy onto other forms\",\"Fill this line out on LGT-SUM\",'LTG-SUM'!C4)","v":"Fill this line out on LGT-SUM"},null,{"$f":"'LTG-SUM'!F4","v":"For Building Department Use"}]
[null,{"$f":"IF('LTG-SUM'!C5=\"3 - This address line will copy onto other forms\",\"Fill this line out on LGT-SUM\",'LTG-SUM'!C5)","v":"Fill this line out on LGT-SUM"}]
[null,{"$f":"IF('LTG-SUM'!C6=\"4 - This address line will copy onto other forms\",\"Fill this line out on LGT-SUM\",'LTG-SUM'!C6)","v":"Fill this line out on LGT-SUM"}]
[null,{"$f":"IF('LTG-SUM'!C7=\"1 - This address line will copy onto other forms\",\"Fill this line out on LGT-SUM\",'LTG-SUM'!C7)","v":0}]
[null,{"$f":"IF('LTG-SUM'!C8=\"1 - This address line will copy onto other forms\",\"Fill this line out on LGT-SUM\",'LTG-SUM'!C8)","v":0}]
[]
["Project Description"]
{"$rows_left_out":159}
{"sheet":"LTG-EXT-REF","index":8,"n_rows":47,"n_cols":26,"rows_kept":47,"cut":false,"hidden":true,"merged":[[10,10,10,11],[28,8,28,9],[10,8,10,9],[10,1,10,2],[28,3,28,4],[10,3,10,4],[28,5,28,6],[10,5,10,6],[28,1,28,2]]}
[]
[]
[]
[]
["Selected Lighting Zone",5,"Site Allowance",{"$f":"VLOOKUP(\"Base Site Allowance\",TradableAreas,Numb_Col,FALSE)","v":0}]
["Column Index"]
["Text","Number"]
[{"$f":"ROUND(IF(B5>=4,3,2)+(Zone-1)*2,1)","v":11},{"$f":"ROUND(IF(B5>=4,4,3)+(Zone-1)*2,1)","v":12}]
["Exterior Lighting Allowance Lookup Tables"]
[null,null,null,null,null,null,null,null,null,null,null,null,null,"If we set up area checking for tradable lighting"]
{"$rows_left_out":38}
{"sheet":"LTG-LPA","index":9,"n_rows":45,"n_cols":9,"rows_kept":45,"cut":false,"hidden":true,"merged":[]}
["Lighting Power Allowance Adjustments",null,null,null,null,"LTG-LPA"]
[{"$f":"#REF!","v":{"$error":"#REF!"}},null,null,null,null,{"$f":"#REF!","v":{"$error":"#REF!"}}]
[{"$f":"#REF!","v":{"$error":"#REF!"}},{"$f":"#REF!","v":{"$error":"#REF!"}},null,null,{"$f":"#REF!","v":{"$error":"#REF!"}},{"$f":"#REF!","v":{"$error":"#REF!"}}]
[]
[" "]
["Adjusted Lighting Power Allowances (Interior)"]
["Location\n(floor plan/room #)","Occupancy Description","Allowed\nWatts per ft2 **","Ceiling Height for this room","Ceiling Height limit for this exception**","Adjusted LPA\nWatts per ft2",null,null,"Not sure this is needed but need some way to enter atriums"]
[null,null,null,null,{"$f":"IF(temp!A1=1,\"9 feet\",IF(temp!A1=2,\"12 feet\",IF(temp!A1=3,\"20 feet\",\"\")))","v":""},{"$f":"IF(AND(D8>I8,I8>8),C8*(1+(0.02*(D8-I8))),C8)","v":0},null,null,{"$f":"LOOKUP(temp!A1,$C$42:$D$45)","v":0}]
[null,null,null,null,{"$f":"IF(temp!A2=1,\"9 feet\",IF(temp!A2=2,\"12 feet\",IF(temp!A2=3,\"20 feet\",\"\")))","v":""},{"$f":"IF(AND(D9>I9,I9>8),C9*(1+(0.02*(D9-I9))),C9)","v":0},null,null,{"$f":"LOOKUP(temp!A2,$C$42:$D$45)","v":0}]
[null,null,null,null,{"$f":"IF(temp!A3=1,\"9 feet\",IF(temp!A3=2,\"12 feet\",IF(temp!A3=3,\"20 feet\",\"\")))","v":""},0,null,null,{"$f":"LOOKUP(temp!A3,$C$42:$D$45)","v":0}]
{"$rows_left_out":36}
{"sheet":"LTG-CHK","index":10,"n_rows":94,"n_cols":6,"rows_kept":94,"cut":false,"hidden":false,"merged":[[70,0,70,5],[6,0,7,0],[6,1,7,1],[6,2,7,2],[8,0,10,0],[8,1,10,1],[8,2,10,2],[12,0,13,0],[12,1,13,1],[12,2,13,2],[14,0,15,0],[14,1,15,1],[14,2,15,2],[17,0,18,0],[17,1,18,1],[17,2,18,2],[19,0,20,0],[19,1,20,1],[19,2,20,2],[22,0,23,0],[22,1,23,1],[22,2,23,2],[24,0,25,0],[24,1,25,1],[24,2,25,2],[45,0,47,0],[45,1,47,1],[45,2,47,2],[26,0,27,0],[26,1,27,1],[26,2,27,2],[35,0,38,0],[35,1,38,1],[35,2,38,2],[31,0,33,0],[31,1,33,1],[31,2,33,2]]}
["Lighting, Motor, and Transformer Permit Documents Checklist",null,null,null,null,"LTG-CHK"]
[{"$f":"'LTG-SUM'!A2","v":"2012 Washington State Energy Code Compliance Forms for Commercial Buildings including R2 & R3 over 3 stories and all R1 "},null,null,null,null,{"$f":"'LTG-SUM'!G2","v":"Revised Jan 2014"}]
["Project Address",null,{"$f":"IF('LTG-SUM'!C3=\"1 - This address line will copy onto other forms\",\"Fill this line out on LGT-SUM\",'LTG-SUM'!C3)","v":"Fill this line out on LGT-SUM"},null,"Date",{"$f":"'LTG-SUM'!G3","v":"2013-05-21"}]
[]
["Applicability (yes,no,na)","Code Section","Component","Compliance information required in permit documents","Location in Documents","Building Department Notes"]
["LIGHTING CONTROLS (Section C405.2)"]
[null,"C405.2.1.1 C405.2.1.2","Manual interior lighting controls","Indicate on plans the manual control type & locations served;"]
[null,null,null,"Indicate of plans the 50% lighting load reduction method provided or identify exception taken "]
[null,"C405.2.2.1","Automatic time switch controls and override switching","Indicate lighting system automatic shut-off capability - identify lighting zone areas served on plans;"]
[null,null,null,"Indicate locations of override switches on plans and the areas served, include area sq. ft.;"]
{"$rows_left_out":84}