{"text_format":"1","workbook":"xlsx","n_sheets":9,"sheets":["ReadMe","LTG-SUM","LTG-INT-SPACE","LTG-INT-DISPLAY","LTG-INT-BLD","LTG-INT-REF","LTG-EXT","LTG-EXT-REF","LTG-CHK"],"not_rendered":{"charts":0,"images":0,"macros":1,"external_links":0,"defined_names":73,"comments":1,"pivot_tables":0},"unopened":[],"bounds":{"document_bytes":16777216,"sheet_cells":100000,"rows_first":2000,"rows_last":500,"rows_between":2000,"halvings":0,"cell_chars":16384,"cell_head_chars":4096},"cells_cut":0,"cells_raw":0,"read":"whole","date_system":"1900"}

{"sheet":"ReadMe","index":0,"n_rows":48,"n_cols":2,"rows_kept":48,"cut":false,"hidden":false,"merged":[[1,0,1,1],[5,0,6,0],[9,0,10,0],[13,0,19,0],[47,0,47,1],[28,0,28,1],[39,0,40,0],[41,0,44,0],[45,0,46,0],[36,0,38,0],[33,0,35,0],[30,0,32,0],[21,0,23,0]]}
["Instructions for Electronic Forms, pg 1"]
["2015 Washington State Energy Code Compliance Forms for Commercial Buildings including R2, R3, R4 over 3 stories and all R1 "]
[null,"Revised August 2016"]
[null,"     Commercial Provision Chapters 1 - 5 of the 2015 Washington State Energy Code apply to all commercial occupancies, R-2, R-3 and R-4 occupancies greater than 3 stories above grade, and R-1 occupancy (all building heights)."]
["Intro","     This file, LTG15-v1.XLSM, has electronic compliance forms for electrical power and lighting system provisions as defined in Section C405 and Chapter 5. This includes interior and exterior lighting systems, electric motors, and transformers. There are two companion files: ENV15-v1.XLSM (Sections C303, C402, Chapter 5, and Appendix A envelope requirements) and MECH15-v1.XLSM (Section C403 and Chapter 5 mechanical systems requirements). "]
["Energy Code ","    This form is a compliance aid and is not a substitute for the full energy code text or specific jurisdiction compliance requirements. Users should refer to the code text and contact the local jurisdiction for complete information. The full 2015 WSEC code text is available for download from the NEEC website:"]
[null,"http:/www.neec.net/energy-codes"]
["Training ","Refer to the NEEC website for instruction on how to complete all of the 2015 WSEC Compliance Forms."]
["Start-up","Select this file from the NEEC website to download to your computer. When opening the file be sure to Enable Macros and if applicable Enable Content. "]
["Overview ","     This file is an Excel workbook that contains multiple compliance forms and resources in Excel worksheets. Each worksheet is indicated by a tab at the bottom of the screen. You may visit each worksheet by selecting it's tab. "]
[null,"     Most calculations are automated. Cells that display informational text and the results of calculations are write-protected and cannot be edited. "]
["Save Files ","This file is saved in the same manner as any standard Excel file. "]
["Getting Around","     Some forms have multiple pages. All pages are available on screen when you select the tab for a form (worksheet). Use the scroll bars or page down key to find additional pages located below the first page."]
["Input Cells ","     All general project information and the date are entered once on LTG-SUM. This information is automatically replicated on all other LTG forms. The LTG-SUM form accompanies all other LTG forms except LTG-EXT, which is a stand alone form."]
[null,"     Only input cells are accessible. If you try to edit a write-protected cell an error message will appear requesting a password. A password IS NOT required to complete these forms. You may use the TAB key to move to the next input cell. If the TAB doesn't take you where you want to go, use your mouse to move around the form. "]
{"$rows_left_out":34}
{"sheet":"LTG-SUM","index":1,"n_rows":44,"n_cols":7,"rows_kept":44,"cut":false,"hidden":false,"merged":[[23,2,23,3],[17,2,17,3],[19,2,19,3],[18,2,18,3],[21,2,21,3],[22,2,22,3],[37,0,37,1],[31,2,35,6],[41,0,41,1],[43,0,43,1],[2,2,2,4],[3,2,3,4],[4,2,4,4],[5,2,5,4],[6,2,6,4],[12,2,12,4],[13,2,13,4],[14,2,14,4],[7,2,7,4],[8,2,8,4],[24,2,24,3],[16,2,16,3]]}
["Lighting Summary",null,null,null,null,null,"LGT-SUM"]
[{"$f":"ReadMe!A2","v":"2015 Washington State Energy Code Compliance Forms for Commercial Buildings including R2, R3, R4 over 3 stories and all R1 "},null,null,null,null,null,{"$f":"ReadMe!B3","v":"Revised August 2016"}]
["Project Info","Project Title:","1 - This title will copy onto other forms",null,null,"Date","2016-07-01"]
[null,null,null,null,null,"For Building Department Use"]
[null,"Company Name:"]
[null,"Company Address:"]
[null,"Applicant Name:"]
[null,"Applicant Phone:"]
[null,"Applicant Email:"]
[]
["Project Description",null,null,null,null,false]
[]
["Building Additions",null,"Compliance Method",null,null,"Interior lighting","Exterior lighting"]
[]
[]
{"$rows_left_out":30}
{"sheet":"LTG-INT-SPACE","index":2,"n_rows":178,"n_cols":11,"rows_kept":178,"cut":false,"hidden":false,"merged":[[44,10,46,10],[3,0,4,0],[22,0,23,5]]}
["Interior Lighting - Space-By-Space Method",null,null,null,null,"LTG-INT-SPACE"]
[{"$f":"'LTG-SUM'!A2","v":"2015 Washington State Energy Code Compliance Forms for Commercial Buildings including R2, R3, R4 over 3 stories and all R1 "},null,null,null,null,{"$f":"'LTG-SUM'!G2","v":"Revised August 2016"}]
["Project Title:",{"$f":"IF('LTG-SUM'!C3=\"1 - This title will copy onto other forms\",\"Fill this line out on LGT-SUM\",'LTG-SUM'!C3)","v":"Fill this line out on LGT-SUM"},null,null,{"$f":"'LTG-SUM'!F3","v":"Date"},{"$f":"'LTG-SUM'!G3","v":"2016-07-01"}]
["Calculation Area NOTE 9",null,null,null,{"$f":"'LTG-SUM'!F4","v":"For Building Department Use"}]
[]
[]
[]
["LPA Calculation Type"]
[]
["Maximum Allowed Lighting Wattage NOTE 1"]
["Location (plan #,\n room #)","Space Type","Ceiling \nHeight NOTE 2","Gross Interior \nArea in ft2","Allowed\nWatts per ft2","Watts Allowed\n(watts/ft2 x area)"]
[null,null,null,null,{"$f":"IF(B12=\"\",0,IF(B12=\"Atrium\",IF(ISNUMBER(C12),MIN(C12,40)*0.02+MAX(C12-40,0)*0.02+IF(C12>40,0.03,0),0),VLOOKUP(B12,$B$67:$C$165,2,FALSE)*IF(ISNUMBER(C12),MAX(1,1+0.02*(C12-VLOOKUP(B12,$B$67:$D$165,3,FALSE))),1)))","v":0},{"$f":"IF(IntCalculationScopeSBS=1,0,E12*D12)","v":0}]
[null,null,null,null,{"$f":"IF(B13=\"\",0,IF(B13=\"Atrium\",IF(ISNUMBER(C13),MIN(C13,40)*0.02+MAX(C13-40,0)*0.02+IF(C13>40,0.03,0),0),VLOOKUP(B13,$B$67:$C$165,2,FALSE)*IF(ISNUMBER(C13),MAX(1,1+0.02*(C13-VLOOKUP(B13,$B$67:$D$165,3,FALSE))),1)))","v":0},0]
[null,null,null,null,0,0]
[null,null,null,null,0,0]
{"$rows_left_out":164}
{"sheet":"LTG-INT-DISPLAY","index":3,"n_rows":102,"n_cols":9,"rows_kept":102,"cut":false,"hidden":false,"merged":[[55,1,55,2],[56,1,56,2],[57,1,57,2],[58,1,58,2],[59,1,59,2],[6,1,6,2],[7,1,7,2],[8,1,8,2],[9,1,9,2],[10,1,10,2]]}
["Interior Display Lighting - Space-by-Space",null,null,null,null,"LTG-INT-DISPLAY"]
[{"$f":"'LTG-SUM'!A2","v":"2015 Washington State Energy Code Compliance Forms for Commercial Buildings including R2, R3, R4 over 3 stories and all R1 "},null,null,null,null,{"$f":"'LTG-SUM'!G2","v":"Revised August 2016"}]
[{"$f":"'LTG-SUM'!B3","v":"Project Title:"},{"$f":"IF('LTG-SUM'!C3=\"1 - This title will copy onto other forms\",\"Fill this line out on LGT-SUM\",'LTG-SUM'!C3)","v":"Fill this line out on LGT-SUM"},null,null,{"$f":"'LTG-SUM'!F3","v":"Date"},{"$f":"'LTG-SUM'!G3","v":"2016-07-01"}]
[null,null,null,null,{"$f":"'LTG-SUM'!F4","v":"For Building Department Use"}]
[]
["Maximum Allowed Retail Display Lighting Wattage"]
["Location (plan #,\n room #)","Retail Sales Area Type NOTE 1",null,"Gross Interior \nArea in ft2","Allowed Watts\n per ft2  NOTE 2","Watts Allowed\n(watts/ft2 x area)"]
[null,null,null,null,{"$f":"IF(B8=\"\",0,VLOOKUP(B8,$E$91:$F$94,2,FALSE))","v":0},{"$f":"IF(B8=\"\",\"\",IF(ISNA(IF(VLOOKUP(VLOOKUP(B8,$E$91:$G$94,3,FALSE),$D$97:$E$100,2,0)>0,\"\",NA())),\"No display\",E8*D8))","v":""},{"$f":"IF(ISNA(INDEX(B$8:B$12,MATCH(0,COUNTIF(G$7:$G7,B$8:B$12),0))),\"\",INDEX(B$8:B$12,MATCH(0,COUNTIF(G$7:$G7,B$8:B$12),0)))","v":0},{"$f":"D8*E8","v":0}]
[null,null,null,null,{"$f":"IF(B9=\"\",0,VLOOKUP(B9,$E$91:$F$94,2,FALSE))","v":0},{"$f":"IF(B9=\"\",\"\",IF(ISNA(IF(VLOOKUP(VLOOKUP(B9,$E$91:$G$94,3,FALSE),$D$97:$E$100,2,0)>0,\"\",NA())),\"No display\",E9*D9))","v":""},{"$f":"IF(ISNA(INDEX(B$8:B$12,MATCH(0,COUNTIF(G$7:$G8,B$8:B$12),0))),\"\",INDEX(B$8:B$12,MATCH(0,COUNTIF(G$7:$G8,B$8:B$12),0)))","v":""},{"$f":"D9*E9","v":0},{"$f":"IF(ISNA(INDEX(G$8:G$12,MATCH(0,COUNTIF(I$7:$I8,G$8:G$12),0))),\"\",INDEX(G$8:G$12,MATCH(0,COUNTIF(I$7:$I8,G$8:G$12),0)))","v":0}]
[null,null,null,null,{"$f":"IF(B10=\"\",0,VLOOKUP(B10,$E$91:$F$94,2,FALSE))","v":0},{"$f":"IF(B10=\"\",\"\",IF(ISNA(IF(VLOOKUP(VLOOKUP(B10,$E$91:$G$94,3,FALSE),$D$97:$E$100,2,0)>0,\"\",NA())),\"No display\",E10*D10))","v":""},{"$f":"IF(ISNA(INDEX(B$8:B$12,MATCH(0,COUNTIF(G$7:$G9,B$8:B$12),0))),\"\",INDEX(B$8:B$12,MATCH(0,COUNTIF(G$7:$G9,B$8:B$12),0)))","v":""},{"$f":"D10*E10","v":0},{"$f":"IF(ISNA(INDEX(G$8:G$12,MATCH(0,COUNTIF(I$7:$I9,G$8:G$12),0))),\"\",INDEX(G$8:G$12,MATCH(0,COUNTIF(I$7:$I9,G$8:G$12),0)))","v":""}]
[null,null,null,null,{"$f":"IF(B11=\"\",0,VLOOKUP(B11,$E$91:$F$94,2,FALSE))","v":0},{"$f":"IF(B11=\"\",\"\",IF(ISNA(IF(VLOOKUP(VLOOKUP(B11,$E$91:$G$94,3,FALSE),$D$97:$E$100,2,0)>0,\"\",NA())),\"No display\",E11*D11))","v":""},{"$f":"IF(ISNA(INDEX(B$8:B$12,MATCH(0,COUNTIF(G$7:$G10,B$8:B$12),0))),\"\",INDEX(B$8:B$12,MATCH(0,COUNTIF(G$7:$G10,B$8:B$12),0)))","v":""},{"$f":"D11*E11","v":0},{"$f":"IF(ISNA(INDEX(G$8:G$12,MATCH(0,COUNTIF(I$7:$I10,G$8:G$12),0))),\"\",INDEX(G$8:G$12,MATCH(0,COUNTIF(I$7:$I10,G$8:G$12),0)))","v":""}]
[]
[null,null,"Total Retail With Display Area",{"$f":"SUM(D8:D12)","v":0},"Total Watts",{"$f":"IF(SUM(F8:F12)>0,SUM(F8:F12),0)","v":0}]
[]
[null,null,null,null,"Retail Display Lighting Base Allowance",{"$f":"IF(SUM(F8:F12)>0,500,0)","v":0}]
{"$rows_left_out":88}
{"sheet":"LTG-INT-BLD","index":4,"n_rows":94,"n_cols":11,"rows_kept":94,"cut":false,"hidden":false,"merged":[[3,0,4,0],[36,1,36,2],[37,1,37,2],[34,1,34,2],[35,1,35,2]]}
["Interior Lighting - Building Area Method",null,null,null,null,"LTG-INT-BLD"]
[{"$f":"'LTG-SUM'!A2","v":"2015 Washington State Energy Code Compliance Forms for Commercial Buildings including R2, R3, R4 over 3 stories and all R1 "},null,null,null,null,{"$f":"'LTG-SUM'!G2","v":"Revised August 2016"}]
[{"$f":"'LTG-SUM'!B3","v":"Project Title:"},{"$f":"IF('LTG-SUM'!C3=\"1 - This title will copy onto other forms\",\"Fill this line out on LGT-SUM\",'LTG-SUM'!C3)","v":"Fill this line out on LGT-SUM"},null,null,{"$f":"'LTG-SUM'!F3","v":"Date"},{"$f":"'LTG-SUM'!G3","v":"2016-07-01"}]
["Calculation Area NOTE 8",null,null,null,{"$f":"'LTG-SUM'!F4","v":"For Building Department Use"}]
[]
[]
["LPA Calculation Type"]
[]
[{"$f":"IF(IntAlt_LT50pctBA,\"Use Space-by-space for less than 50% lighting retrofit\",\"Maximum Allowed Lighting Wattage\")","v":"Maximum Allowed Lighting Wattage"}]
["Building Area","Location (plan #,\n room #, or ALL)","Area Description","Gross Interior \nArea in ft2","Allowed\nWatts per ft2","Watts Allowed\n(watts/ft2 x area)"]
[null,null,null,null,{"$f":"IF(A11=\"\",0,VLOOKUP(A11,$A$63:$B$94,2,FALSE))","v":0},{"$f":"IF(AND(A11=\"\",E11=0,D11=0),0,IF(ISNA(IF(VLOOKUP(A11,$A$22:$F$33,6,FALSE)>0,\"\",NA())),\"Unlit\",ROUNDUP(E11*D11,0)))","v":0},{"$f":"IF(ISNA(INDEX(A$11:A$18,MATCH(0,COUNTIF(G$10:$G10,A$11:A$18),0))),\"\",INDEX(A$11:A$18,MATCH(0,COUNTIF(G$10:$G10,A$11:A$18),0)))","v":0}]
[null,null,null,null,0,{"$f":"IF(AND(A12=\"\",E12=0,D12=0),0,IF(ISNA(IF(VLOOKUP(A12,$A$22:$F$33,6,FALSE)>0,\"\",NA())),\"Unlit\",ROUNDUP(E12*D12,0)))","v":0},{"$f":"IF(ISNA(INDEX(A$11:A$18,MATCH(0,COUNTIF(G$10:$G11,A$11:A$18),0))),\"\",INDEX(A$11:A$18,MATCH(0,COUNTIF(G$10:$G11,A$11:A$18),0)))","v":""}]
[null,null,null,null,0,0,{"$f":"IF(ISNA(INDEX(A$11:A$18,MATCH(0,COUNTIF(G$10:$G12,A$11:A$18),0))),\"\",INDEX(A$11:A$18,MATCH(0,COUNTIF(G$10:$G12,A$11:A$18),0)))","v":""}]
[null,null,null,null,0,0,{"$f":"IF(ISNA(INDEX(A$11:A$18,MATCH(0,COUNTIF(G$10:$G13,A$11:A$18),0))),\"\",INDEX(A$11:A$18,MATCH(0,COUNTIF(G$10:$G13,A$11:A$18),0)))","v":""},null,null,null,1]
[null,null,null,null,0,0,{"$f":"IF(ISNA(INDEX(A$11:A$18,MATCH(0,COUNTIF(G$10:$G14,A$11:A$18),0))),\"\",INDEX(A$11:A$18,MATCH(0,COUNTIF(G$10:$G14,A$11:A$18),0)))","v":""},null,null,null,1]
{"$rows_left_out":80}
{"sheet":"LTG-INT-REF","index":5,"n_rows":84,"n_cols":18,"rows_kept":84,"cut":false,"hidden":true,"merged":[[13,8,13,11]]}
["Method"]
[2,"NO Longer used 2015 (1=building area, 2=space-by-space, 3=not specified"]
["Calculation Scope (area calculation is for)",null,"intCalcScopeSet"]
[0,{"$f":"IF(IntCalculationScopeSBS=1,TRUE,FALSE)","v":false},{"$f":"IntCalculationScopeSBS<>5","v":true}]
[5,{"$f":"IF(intCalculationScopeBA=1,TRUE,FALSE)","v":false},{"$f":"intCalculationScopeBA<>5","v":false}]
["Calculation Type",null,"CalcTypeSet"]
[3,"C406.4 Reduced Lighting Power=2",{"$f":"CalcTypeSBS<>3","v":false}]
[3,"C406.4 Reduced Lighting Power=2",{"$f":"CalcTypeBA<>3","v":false},null,null,null,null,null,null,{"$f":"SUMPRODUCT('LTG-INT-BLD'!D22:D32,'LTG-INT-BLD'!E22:E32)","v":0},"watts entered"]
["Dwelling Method",null,null,null,null,null,null,null,null,{"$f":"SUM(J16:J35)","v":0},"watts in allowed catagories"]
[4,"Not used in calculations  6/2016",null,null,null,null,null,"Number of Unique Areas"]
["Pass",null,null,null,null,null,null,{"$f":"21-COUNTIF(G16:G35,NA())-1","v":0},null,null,null,null,null,"Text denoting areas not defined (used here and on LTG-INT-BLD"]
[{"$f":"SUM(L16:L35)=0","v":true},{"$f":"IF(A12=FALSE,MID(E12,1,LEN(E12)-2),IF(SUM(J16:J50)>0,IF(J8=J9,\"ALL AREAS COMPLY\",\"PROPOSED LIGHTING IN UNDEFINED SPACE TYPE\"),\"\"))","v":""},null,null,{"$f":"IF(A12=FALSE,\"The following areas do not comply: \",\"\")","v":""},null,null,null,{"$f":"IF(J12=\"\",,IF(MID(J12,LEN(J12)-1,2)=\", \",MID(J12,1,LEN(J12)-2),J12))","v":0},{"$f":"IF(A12=FALSE,CONCATENATE(Q16,Q17,Q18,Q19,Q20,Q21,Q22,Q23,Q24,Q25,Q26,Q27,Q28,Q29,Q30,Q31,Q32,Q33,#REF!,Q34,Q35),\"\")","v":""},null,null,null,"Not Defined"]
["Low LPD",null,null,null,null,null,null,"Specified Building Areas"]
[{"$f":"SUM(P16:P35)>0","v":false},{"$f":"IF(A14=TRUE,\"Areas with low LPD's.  Check that all proposed fixtures are entered:\",\"\")","v":""},null,null,{"$f":"IF(A14=TRUE,CONCATENATE(R16,R17,R18,R19,R20,R21,R22,R23,R24,R25,R26,R27,R28,R29,R30,R31,R32,R33,R34,R35),\"\")","v":""},null,null,null,"Watts",null,null,null,null,"Area"]
[null,{"$f":"IF(A14=TRUE,MID(E14,1,LEN(E14)-2),\"\")","v":""},null,null,null,null,null,null,"allowed","proposed","Over","Fail","Fail C406.4","Undefined","No lights","low LPD","watts error","lowLPD error"]
{"$rows_left_out":70}
{"sheet":"LTG-EXT","index":6,"n_rows":89,"n_cols":11,"rows_kept":89,"cut":false,"hidden":false,"merged":[[6,0,7,0],[3,0,4,0]]}
["Exterior Lighting",null,null,null,"LTG-EXT"]
[{"$f":"'LTG-SUM'!A2","v":"2015 Washington State Energy Code Compliance Forms for Commercial Buildings including R2, R3, R4 over 3 stories and all R1 "},null,null,null,{"$f":"'LTG-SUM'!G2","v":"Revised August 2016"}]
["Project Title:",{"$f":"IF('LTG-SUM'!C3=\"1 - This title will copy onto other forms\",\"Fill this line out on LGT-SUM\",'LTG-SUM'!C3)","v":"Fill this line out on LGT-SUM"},null,{"$f":"'LTG-SUM'!F3","v":"Date"},{"$f":"'LTG-SUM'!G3","v":"2016-07-01"}]
["Exterior Lighting Zone ",null,null,{"$f":"'LTG-SUM'!F4","v":"For Building Department Use"}]
[]
[]
["Calculation Area",null,null,null,{"$f":"'LTG-SUM'!F7","v":0}]
[]
[]
["Building Grounds"]
[]
[]
["Tradable Maximum Allowed Lighting Wattage NOTE 1",null,null,"Base Site Allowance:",{"$f":"Base_Site_Allowance","v":0}]
[]
["Tradable Surfaces","\nSurface Description","Area (ft2), perimeter (lf) or # of items","Allowed Watts\nper ft2 or per lf","Allowed Watts \nx ft2 (or x lf)",null,null,null," "]
{"$rows_left_out":75}
{"sheet":"LTG-EXT-REF","index":7,"n_rows":59,"n_cols":22,"rows_kept":59,"cut":false,"hidden":true,"merged":[[10,10,10,11],[29,8,29,9],[10,8,10,9],[10,1,10,2],[29,3,29,4],[10,3,10,4],[29,5,29,6],[10,5,10,6],[29,1,29,2]]}
["Calculation Scope","ExtAlt_LT50pct"]
[5,{"$f":"ExtCalculationScope=1","v":false}]
[]
[]
["Selected Lighting Zone",5,"Site Allowance",{"$f":"IF(ExtAlt_LT50pct,0,VLOOKUP(\"Base Site Allowance\",TradableAreas,Numb_Col,FALSE))","v":0}]
["Column Index"]
["Text","Number"]
[{"$f":"ROUND(IF(B5>=4,3,2)+(Zone-1)*2,1)","v":11},{"$f":"ROUND(IF(B5>=4,4,3)+(Zone-1)*2,1)","v":12}]
["Exterior Lighting Allowance Lookup Tables"]
[null,null,null,null,null,null,null,null,null,null,null,null,null,"If we set up area checking for tradable lighting"]
[null,"Zone 1",null,"Zone 2",null,"Zone 3",null,null,"Zone 4",null,"No Zone Selected",null,null,null,"Error","kind of error"]
["Tradable Locations","text","W/unit","text","W/unit","text","W/unit",null,"text","W/unit",null,null,"allowed","proposed","unlit area","undeclared area"]
["Base Site Allowance","500 W",500,"600 W",600,"750 W",750,null,"1300 W",1300,"Select Zone",0,0,0,0,0]
["Uncovered Parking and drives","0.04 W/ft2",0.04,"0.06 W/ft2",0.06,"0.08 W/ft2",0.08,null,"0.10 W/ft2",0.1,"Select Zone",0,{"$f":"SUMIF('LTG-EXT'!$A$16:$A$20,A14,'LTG-EXT'!$E$16:$E$20)","v":0},{"$f":"SUMIF('LTG-EXT'!$A$24:$A$27,A14,'LTG-EXT'!$E$24:$E$27)","v":0},{"$f":"IF(AND(M14>0,N14=0),1,0)","v":0},{"$f":"IF(AND(N14>0,M14=0),1,0)","v":0}]
["Grounds Walkways  <10 wide","0.7 W/LF",0.7,"0.7 W/LF",0.7,"0.8 W/LF",0.8,null,"1.0 W/LF",1,"Select Zone",0,{"$f":"SUMIF('LTG-EXT'!$A$16:$A$20,A15,'LTG-EXT'!$E$16:$E$20)","v":0},{"$f":"SUMIF('LTG-EXT'!$A$24:$A$27,A15,'LTG-EXT'!$E$24:$E$27)","v":0},{"$f":"IF(AND(M15>0,N15=0),1,0)","v":0},{"$f":"IF(AND(N15>0,M15=0),1,0)","v":0}]
{"$rows_left_out":45}
{"sheet":"LTG-CHK","index":8,"n_rows":118,"n_cols":6,"rows_kept":118,"cut":false,"hidden":false,"merged":[[61,0,64,0],[61,1,64,1],[61,2,64,2],[52,1,54,1],[52,2,54,2],[52,0,54,0],[50,0,51,0],[50,1,51,1],[50,2,51,2],[111,0,111,5],[18,0,20,0],[18,1,20,1],[18,2,20,2],[26,0,27,0],[26,1,27,1],[26,2,27,2],[21,0,24,0],[21,1,24,1],[48,0,49,0],[48,1,49,1],[48,2,49,2],[35,0,37,0],[35,1,37,1],[35,2,37,2],[44,0,46,0],[44,1,46,1],[44,2,46,2],[38,0,39,0],[38,1,39,1],[38,2,39,2],[40,0,43,0],[40,1,43,1],[40,2,43,2],[93,0,94,0],[93,1,94,1],[93,2,94,2],[73,0,75,0],[73,1,75,1],[73,2,75,2],[88,0,90,0],[88,1,90,1],[88,2,90,2],[21,2,24,2],[13,0,14,0],[13,1,14,1],[13,2,14,2],[11,0,12,0],[11,1,12,1],[11,2,12,2]]}
["Lighting, Motor, and Electrical Permit Checklist, Pg. 1",null,null,null,null,"LTG-CHK"]
[{"$f":"'LTG-SUM'!A2","v":"2015 Washington State Energy Code Compliance Forms for Commercial Buildings including R2, R3, R4 over 3 stories and all R1 "},null,null,null,null,{"$f":"'LTG-SUM'!G2","v":"Revised August 2016"}]
["Project Title: ",null,{"$f":"IF('LTG-SUM'!C3=\"1 - This title will copy onto other forms\",\"Fill this line out on LGT-SUM\",'LTG-SUM'!C3)","v":"Fill this line out on LGT-SUM"},null,"Date",{"$f":"'LTG-SUM'!G3","v":"2016-07-01"}]
[]
["Applicability (yes,no,na)","Code Section","Component","Compliance information required in permit documents","Location in Documents","Building Department Notes"]
["LIGHTING CONTROLS"]
[null,"C405.2","Lighting controls, general","For all lighting fixtures, indicate lighting control method on plans for spaces and lighting zone(s) served, or exception taken"]
[null,"C405.2","Luminaire level lighting controls (LLLC)","Indicate on plans all fixtures provided with LLLC in lieu of C405.2 lighting controls; provide description of control capabilities and performance parameters"]
[null,"C405.1","Lighting in dwelling units","For permanently installed lighting fixtures in dwelling units, indicate  lighting control method on plans for spaces and lighting zone(s) served, or demonstrate compliance with high efficacy exception"]
[null,"C405.2.3 C405.2.1.1\nC405.2.2.2 C405.2.4 C405.2.5","Manual controls","Indicate on plans the method of manual lighting control (whether combined with occupancy sensor, automatic light reduction,  daylight responsive or specific application controls), location of manual control device and area or specifice application it serves"]
[null,"C405.2.2.1\nC405.2.2.2\nC405.2.3","Manual interior lighting controls","Indicate on plans which method of manual 50% lighting load reduction is provided, or whether lighting load is reduced via occupancy sensors or daylight responsive controls"]
[null,"C405.2.2","Method of automatic shut-off control","Indicate on plans the method of automatic shut-off control during unoccupied periods (occupancy sensor or time switch) for all lighting zones;"]
[null,null,null,"Indicate locations where automatic shutoff is provided by other methods (occupancy sensor or digital timer switch) or which time switch control exception applies"]
[null,"C405.2.1\nC405.2.1.1","Occupancy sensor controls","Indicate on plans the spaces served by occupancy sensors;"]
[null,null,null,"Indicate whether occupancy sensor controls are configured to be manual-on, automatic 50%-on, or serve a space eligible for automatic 100%-on per exception"]
{"$rows_left_out":103}