{"text_format":"1","workbook":"xlsx","n_sheets":18,"sheets":["ReadMe","ReadMe (2)","MECH-SUM","MECH-CHK","MECH-ECONO org","MECH-CHK (2)","SWH-CHK","MECH-VENT","MECH-VENT org","MECH-ECONO","MECH-FANSYS-SUM","MECH-FANSYS","MECH-FANSYS-DOC","MECH-LOAD-CALC","MECH-EQ","MECH-EQ BOILER-CHILLER","MECH-EQ HEAT REJECTION","MECH-EQ AIR SYSTEM TERMINALS"],"not_rendered":{"charts":0,"images":2,"macros":1,"external_links":0,"defined_names":141,"comments":1,"pivot_tables":0},"unopened":[],"bounds":{"document_bytes":16777216,"sheet_cells":100000,"rows_first":2000,"rows_last":500,"rows_between":2000,"halvings":0,"cell_chars":16384,"cell_head_chars":4096},"cells_cut":0,"cells_raw":0,"read":"whole","date_system":"1900"}

{"sheet":"ReadMe","index":0,"n_rows":34,"n_cols":2,"rows_kept":34,"cut":false,"hidden":false,"merged":[[27,0,30,0],[31,0,32,0],[13,0,19,0],[0,0,0,1],[1,0,1,1],[9,0,10,0],[21,0,23,0],[24,0,26,0],[24,1,26,1]]}
["Instructions for Electronic Forms"]
["2015 Washington State Energy Code Compliance Forms for Commercial Buildings including R2 & R3 over 3 stories and all R1 "]
[null,"Revised January 2017"]
[null,"     Commercial Provision Chapters 1 - 5 of the 2015 Washington State Energy Code apply to all commercial occupancies, R-2 and R-3 occupanies greater than 3 stories above grade, and R-1 occupancy (all building heights)."]
["Intro","     This file, MECH15-v2.XLSM, has electronic compliance forms for mechanical provisions as defined in Sections C403, C404, C408, and Chapter 5. There are two companion files: ENV15-v2.XLSM (Sections C303, C402, Chapter 5, and Appendix A envelope requirements), LTG15-v3.XLSM (Section C405 and Chapter 5 lighting systems requirements). "]
["Energy Code","    This form is a compliance aid and is not a substitute for the full energy code text or specific jurisdiction compliance requirements. Users should refer to the code text and contact the local jurisdiction for complete information. The full 2015 WSEC code text is available for download from the NEEC website:"]
[null,"http:/www.neec.net/energy-codes"]
["Training ","Refer to the NEEC website for instruction on how to complete all of the 2015 WSEC Compliance Forms."]
{"$rows_left_out":27}
{"sheet":"ReadMe (2)","index":1,"n_rows":34,"n_cols":5,"rows_kept":34,"cut":false,"hidden":true,"merged":[[21,0,23,0],[24,0,26,0],[24,1,26,1],[27,0,30,0],[31,0,32,0],[13,0,19,0],[0,0,0,1],[0,3,0,4],[1,0,1,1],[1,3,1,4],[9,0,10,0]]}
["Instructions for Electronic Forms",null,null,"Form Requirements"]
["2015 Washington State Energy Code Compliance Forms for Commercial Buildings including R2 & R3 over 3 stories and all R1 ",null,null,{"$f":"A2","v":"2015 Washington State Energy Code Compliance Forms for Commercial Buildings including R2 & R3 over 3 stories and all R1 "}]
[null,"Revised January 2016",null,null,{"$f":"B3","v":"Revised January 2016"}]
[null,"     Commercial Provision Chapters 1 - 5 of the 2015 Washington State Energy Code apply to all commercial occupancies, R-2 and R-3 occupanies greater than 3 stories above grade, and R-1 occupancy (all building heights)."]
["Intro","     This file, MECH15-v2.XLSM, has electronic compliance forms for mechanical provisions as defined in Sections C403, C404, C408, and Chapter 5. There are two companion files: ENV15-v2.XLSM (Sections C303, C402, Chapter 5, and Appendix A envelope requirements), LTG15-v2.XLSM (Section C405 and Chapter 5 lighting systems requirements). "]
["Energy Code","    This form is a compliance aid and is not a substitute for the full energy code text or specific jurisdiction compliance requirements. Users should refer to the code text and contact the local jurisdiction for complete information. The full 2015 WSEC code text is available for download from the NEEC website:"]
[null,"http:/www.neec.net/energy-codes"]
["Training ","Refer to the NEEC website for instruction on how to complete all of the 2015 WSEC Compliance Forms."]
{"$rows_left_out":27}
{"sheet":"MECH-SUM","index":2,"n_rows":99,"n_cols":9,"rows_kept":99,"cut":false,"hidden":false,"merged":[[19,0,19,1],[24,0,26,1],[26,4,26,8],[27,4,27,8],[36,0,36,1],[23,0,23,1],[2,3,2,6],[2,7,2,8],[3,3,3,6],[4,3,4,6],[5,3,5,6],[6,3,6,6],[7,3,7,6],[11,3,12,8],[13,3,13,8],[18,0,18,1],[16,0,16,1],[17,0,17,1],[14,0,14,1],[15,0,15,1]]}
["Mechanical Summary",null,null,null,null,null,null,null,"MECH-SUM"]
[{"$f":"ReadMe!A2","v":"2015 Washington State Energy Code Compliance Forms for Commercial Buildings including R2 & R3 over 3 stories and all R1 "},null,null,null,null,null,null,null,{"$f":"ReadMe!B3","v":"Revised January 2017"}]
["Project Information",null,"Project Title:","1 - This title will copy onto other forms",null,null,null,"2015-01-01"]
[null,null,null,null,null,null,null,"For Building Dept. Use"]
[null,null,"Company Name:"]
[null,null,"Company Address:"]
[null,null,"Applicant Name:"]
[null,null,"Applicant Phone:"]
{"$rows_left_out":92}
{"sheet":"MECH-CHK","index":3,"n_rows":192,"n_cols":6,"rows_kept":192,"cut":false,"hidden":false,"merged":[[138,0,139,0],[138,1,139,1],[138,2,139,2],[170,0,172,0],[170,1,172,1],[170,2,172,2],[142,0,143,0],[142,1,143,1],[142,2,143,2],[161,0,163,0],[161,1,163,1],[161,2,163,2],[167,0,167,5],[146,0,146,5],[165,0,165,5],[73,2,74,2],[114,2,116,2],[131,0,132,0],[131,1,132,1],[131,2,132,2],[128,0,128,5],[121,0,122,0],[121,1,122,1],[121,2,122,2],[104,0,105,0],[104,1,105,1],[104,2,105,2],[100,0,102,0],[86,0,86,5],[73,0,74,0],[87,0,88,0],[64,2,65,2],[64,0,65,0],[70,0,72,0],[70,1,72,1],[70,2,72,2],[64,1,65,1],[68,0,69,0],[68,1,69,1],[68,2,69,2],[2,2,2,3],[3,0,3,3],[5,0,5,5],[10,2,11,2],[12,0,13,0],[10,0,11,0],[10,1,11,1],[12,1,13,1],[12,2,13,2],[22,0,23,0],[22,1,23,1],[22,2,23,2],[40,0,42,0],[57,0,59,0],[57,1,59,1],[57,2,59,2],[45,0,46,0],[45,1,46,1],[45,2,46,2],[40,1,42,1],[40,2,42,2],[35,0,35,5],[76,2,77,2],[80,2,82,2],[87,1,88,1],[87,2,88,2],[100,1,102,1],[100,2,102,2],[92,1,93,1],[92,2,93,2],[114,0,116,0],[80,0,82,0],[80,1,82,1],[76,0,77,0],[76,1,77,1],[92,0,93,0],[114,1,116,1],[177,0,177,5],[168,0,169,0],[168,1,169,1],[168,2,169,2],[73,1,74,1],[106,0,107,0],[106,1,107,1],[106,2,107,2],[108,0,109,0],[108,1,109,1],[108,2,109,2],[134,0,134,5],[136,0,136,5],[112,0,113,0],[112,1,113,1],[112,2,113,2]]}
["Mechanical Permit Plans Checklist",null,null,null,null,"MECH-CHK"]
[{"$f":"ReadMe!A2","v":"2015 Washington State Energy Code Compliance Forms for Commercial Buildings including R2 & R3 over 3 stories and all R1 "},null,null,null,null,{"$f":"ReadMe!B3","v":"Revised January 2017"}]
["Project Title:",null,{"$f":"IF('MECH-SUM'!D3=\"1 - This title will copy onto other forms\",\"Fill this line out on MECH-SUM\",'MECH-SUM'!D3)","v":"Fill this line out on MECH-SUM"},null,"Date",{"$f":"'MECH-SUM'!H3","v":"2015-01-01"}]
["The following information is necessary to check a permit application for compliance with the mechanical systems and equipment requirements of the Washington State Energy Code, Commercial Provisions."]
["Applicable (yes,no,na)","Code Section","Code Provision","Information Required - Must be in permit documents","Location in Documents","Building Department Notes"]
["Equipment - Sizing, Performance and Type"]
[null,"C403.1","Exempt process equipment","Identify equipment to be used in manufacturing, industrial or commercial processes that do not provide space conditioning; identify provisions applicable to this equipment per C403.1 exception"]
[null,"C403.2.1","Load calculations","Provide load calculations performed per ASHRAE Std 183 or equivalent, using design parameters per C302 and Appendix C; include load adjustments to account for energy recovery"]
{"$rows_left_out":185}
{"sheet":"MECH-ECONO org","index":4,"n_rows":83,"n_cols":4,"rows_kept":83,"cut":false,"hidden":true,"merged":[]}
["Economizer Exception Summary",null,null,"MECH-ECONO"]
[{"$f":"#REF!","v":{"$error":"#REF!"}}]
["Project Info","Project Address:",{"$f":"IF('MECH-SUM'!D3=\"1 - This address line will copy onto other forms\",\"Fill this line out on MECH-SUM\",IF('MECH-SUM'!D3=0,\"\",'MECH-SUM'!D3))","v":"1 - This title will copy onto other forms"},{"$f":"'MECH-SUM'!H3","v":"2015-01-01"}]
[null,null,{"$f":"IF('MECH-SUM'!D4=\"1 - This address line will copy onto other forms\",\"Fill this line out on MECH-SUM\",IF('MECH-SUM'!D4=0,\"\",'MECH-SUM'!D4))","v":""},"For Building Dept. Use"]
[null,null,{"$f":"IF('MECH-SUM'!D5=\"1 - This address line will copy onto other forms\",\"Fill this line out on MECH-SUM\",IF('MECH-SUM'!D5=0,\"\",'MECH-SUM'!D5))","v":""}]
[null,"Applicant Name:",{"$f":"IF('MECH-SUM'!D6=\"1 - This address line will copy onto other forms\",\"Fill this line out on MECH-SUM\",IF('MECH-SUM'!D6=0,\"\",'MECH-SUM'!D6))","v":""}]
[null,"Applicant Address:",{"$f":"IF('MECH-SUM'!D7=\"1 - This address line will copy onto other forms\",\"Fill this line out on MECH-SUM\",IF('MECH-SUM'!D7=0,\"\",'MECH-SUM'!D7))","v":""}]
[null,"Applicant Phone:",{"$f":"IF('MECH-SUM'!D8=\"1 - This address line will copy onto other forms\",\"Fill this line out on MECH-SUM\",IF('MECH-SUM'!D8=0,\"\",'MECH-SUM'!D8))","v":""}]
{"$rows_left_out":76}
{"sheet":"MECH-CHK (2)","index":5,"n_rows":121,"n_cols":6,"rows_kept":121,"cut":false,"hidden":true,"merged":[[106,0,107,0],[106,1,107,1],[106,2,107,2],[108,0,109,0],[108,1,109,1],[108,2,109,2],[100,0,102,0],[100,1,102,1],[100,2,102,2],[104,0,105,0],[104,1,105,1],[104,2,105,2],[22,0,23,0],[22,1,23,1],[22,2,23,2],[2,2,2,3],[3,0,3,3],[10,0,11,0],[10,1,11,1],[10,2,11,2],[12,0,13,0],[12,1,13,1],[12,2,13,2],[45,0,46,0],[45,1,46,1],[45,2,46,2],[40,0,42,0],[40,1,42,1],[40,2,42,2],[57,0,59,0],[57,1,59,1],[57,2,59,2],[64,0,65,0],[64,1,65,1],[64,2,65,2],[68,0,69,0],[68,1,69,1],[68,2,69,2],[70,0,72,0],[70,1,72,1],[70,2,72,2],[73,0,74,0],[73,1,74,1],[73,2,74,2],[76,0,77,0],[76,1,77,1],[76,2,77,2],[92,0,93,0],[92,1,93,1],[92,2,93,2],[80,0,82,0],[80,1,82,1],[80,2,82,2],[87,0,88,0],[87,1,88,1],[87,2,88,2],[112,0,113,0],[112,1,113,1],[112,2,113,2],[114,0,116,0],[114,1,116,1],[114,2,116,2]]}
["Service Water Heating Permit Plans Checklist ",null,null,null,null,"SWH-CHK"]
[{"$f":"ReadMe!A2","v":"2015 Washington State Energy Code Compliance Forms for Commercial Buildings including R2 & R3 over 3 stories and all R1 "},null,null,null,null,{"$f":"ReadMe!B3","v":"Revised January 2017"}]
["Project Title:",null,{"$f":"IF('MECH-SUM'!D3=\"1 - This title will copy onto other forms\",\"Fill this line out on MECH-SUM\",'MECH-SUM'!D3)","v":"Fill this line out on MECH-SUM"},null,"Date",{"$f":"'MECH-SUM'!H3","v":"2015-01-01"}]
["The following information is necessary to check a permit application for compliance with the mechanical systems and equipment requirements of the Washington State Energy Code, Commercial Provisions."]
["Applicable (yes,no,na)","Code Section","Code Provision","Information Required - Must be in permit documents","Location in Documents","Building Department Notes"]
["Equipment - Sizing, Performance and Type"]
[null,"C403.1","Exempt process equipment","Identify equipment to be used in manufacturing, industrial or commercial processes that do not provide space conditioning; identify provisions applicable to this equipment per C403.1 exception"]
[null,"C403.2.1","Load calculations","Provide load calculations performed per ASHRAE Std 183 or equivalent, using design parameters per C302 and Appendix C; include load adjustments to account for energy recovery"]
{"$rows_left_out":114}
{"sheet":"SWH-CHK","index":6,"n_rows":66,"n_cols":6,"rows_kept":66,"cut":false,"hidden":false,"merged":[[55,0,55,5],[31,0,32,0],[31,1,32,1],[31,2,32,2],[46,1,47,1],[46,2,47,2],[43,0,44,0],[43,1,44,1],[43,2,44,2],[46,0,47,0],[33,0,34,0],[33,1,34,1],[33,2,34,2],[51,0,53,0],[51,1,53,1],[51,2,53,2],[41,0,42,0],[41,1,42,1],[41,2,42,2],[48,0,50,0],[48,1,50,1],[48,2,50,2],[2,2,2,3],[3,0,3,3],[26,0,27,0],[26,1,27,1],[26,2,27,2],[7,0,9,0],[7,1,9,1],[7,2,9,2],[16,0,17,0],[16,1,17,1],[16,2,17,2],[20,0,21,0],[20,1,21,1],[20,2,21,2]]}
["Service Water Heating Permit Plans Checklist ",null,null,null,null,"SWH-CHK"]
[{"$f":"ReadMe!A2","v":"2015 Washington State Energy Code Compliance Forms for Commercial Buildings including R2 & R3 over 3 stories and all R1 "},null,null,null,null,{"$f":"ReadMe!B3","v":"Revised January 2017"}]
["Project Title:",null,{"$f":"IF('MECH-SUM'!D3=\"1 - This title will copy onto other forms\",\"Fill this line out on MECH-SUM\",'MECH-SUM'!D3)","v":"Fill this line out on MECH-SUM"},null,"Date",{"$f":"'MECH-SUM'!H3","v":"2015-01-01"}]
["The following information is necessary to check a permit application for compliance with the mechanicial systems and equipment requirements of the Washington State Energy Code, Commercial Provisions."]
["Applicable (yes,no,na)","Code Section","Code Provision","Information Required - Must be in permit documents","Location in Documents","Building Department Notes"]
["Equipment - Sizing, Performance and Type"]
[null,"C404.2","SWH equipment type and efficiency","Provide equipment schedule on plans indicating type and capacity; indicate efficiency complies with required federal standard"]
[null,"C404.2.1","High input-rated SWH systems","For individual SWH equipment serving an entire building with ≥ 1,000,000 Btu/h capacity, indicate thermal efficiency ≥ 90%; or exception taken"]
{"$rows_left_out":59}
{"sheet":"MECH-VENT","index":7,"n_rows":57,"n_cols":13,"rows_kept":57,"cut":false,"hidden":true,"merged":[[2,8,2,9],[3,3,3,7],[4,3,4,7],[5,3,5,7],[6,3,6,7],[2,2,2,7]]}
["Ventilation Summary",null,null,null,null,null,null,null,null,"MECH-VENT"]
[{"$f":"ReadMe!A2","v":"2015 Washington State Energy Code Compliance Forms for Commercial Buildings including R2 & R3 over 3 stories and all R1 "},null,null,null,null,null,null,null,null,{"$f":"ReadMe!B3","v":"Revised January 2017"}]
["Project Title:",null,{"$f":"IF('MECH-SUM'!D3=\"1 - This title will copy onto other forms\",\"Fill this line out on MECH-SUM\",'MECH-SUM'!D3)","v":"Fill this line out on MECH-SUM"},null,null,null,null,null,{"$f":"'MECH-SUM'!H3","v":"2015-01-01"}]
[null,null,null,null,null,null,null,null,"For Building Dept. Use"]
[]
[]
[]
[]
{"$rows_left_out":50}
{"sheet":"MECH-VENT org","index":8,"n_rows":23,"n_cols":15,"rows_kept":23,"cut":false,"hidden":true,"merged":[[6,3,6,8],[2,2,2,8],[2,10,2,11],[3,3,3,8],[4,3,4,8],[5,3,5,8]]}
["Ventilation Summary",null,null,null,null,null,null,null,null,null,null,"MECH-VENT"]
[{"$f":"ReadMe!A2","v":"2015 Washington State Energy Code Compliance Forms for Commercial Buildings including R2 & R3 over 3 stories and all R1 "},null,null,null,null,null,null,null,null,null,null,{"$f":"ReadMe!B3","v":"Revised January 2017"}]
["Project Title:",null,{"$f":"IF('MECH-SUM'!D3=\"1 - This title will copy onto other forms\",\"Fill this line out on MECH-SUM\",'MECH-SUM'!D3)","v":"Fill this line out on MECH-SUM"},null,null,null,null,null,null,null,{"$f":"'MECH-SUM'!H3","v":"2015-01-01"}]
[null,null,null,null,null,null,null,null,null,null,"For Building Dept. Use"]
[]
[]
[]
[null,null,null,null,"I don't think we need this here.  Just on Mech EQ",null,null,null,"Or should this be average occupancy load.  A HP VAV would always be some and average would not make sense"]
{"$rows_left_out":16}
{"sheet":"MECH-ECONO","index":9,"n_rows":163,"n_cols":11,"rows_kept":163,"cut":false,"hidden":false,"merged":[[2,1,2,2],[60,1,60,2],[31,4,31,5],[20,4,20,5],[26,4,26,5],[15,4,15,5],[3,3,3,5],[4,3,4,5],[5,3,5,5],[6,3,6,5]]}
["Economizer Exceptions",null,null,null,null,"MECH-ECONO"]
[{"$f":"ReadMe!A2","v":"2015 Washington State Energy Code Compliance Forms for Commercial Buildings including R2 & R3 over 3 stories and all R1 "},null,null,null,null,{"$f":"ReadMe!B3","v":"Revised January 2017"}]
["Project Title:",{"$f":"IF('MECH-SUM'!D3=\"1 - This title will copy onto other forms\",\"Fill this line out on MECH-SUM\",IF('MECH-SUM'!D3=0,\"\",'MECH-SUM'!D3))","v":"Fill this line out on MECH-SUM"},null,null,null,{"$f":"'MECH-SUM'!H3","v":"2015-01-01"}]
[null,null,null,"For Building Dept. Use"]
[]
[]
[null,null,null," "]
[]
{"$rows_left_out":156}
{"sheet":"MECH-FANSYS-SUM","index":10,"n_rows":33,"n_cols":5,"rows_kept":33,"cut":false,"hidden":false,"merged":[[2,3,2,4],[2,1,2,2],[9,6,11,14]]}
["Mechanical Fan System Power Allowance",null,null,null,"MECH-FANSYS-SUM"]
[{"$f":"ReadMe!A2","v":"2015 Washington State Energy Code Compliance Forms for Commercial Buildings including R2 & R3 over 3 stories and all R1 "},null,null,null,{"$f":"ReadMe!B3","v":"Revised January 2017"}]
["Project Title:",{"$f":"IF('MECH-SUM'!D3=\"1 - This title will copy onto other forms\",\"Fill this line out on MECH-SUM\",IF('MECH-SUM'!D3=0,\"\",'MECH-SUM'!D3))","v":"Fill this line out on MECH-SUM"},null,{"$f":"'MECH-SUM'!H3","v":"2015-01-01"}]
[null,null,null,"For Building Dept. Use"]
[]
[]
[]
["HVAC Air Distribution System Schedule"]
{"$rows_left_out":26}
{"sheet":"MECH-FANSYS","index":11,"n_rows":114,"n_cols":12,"rows_kept":114,"cut":false,"hidden":false,"merged":[[19,3,19,5],[2,4,2,5],[6,2,6,5],[2,2,2,3],[3,2,3,3],[4,2,4,3],[5,2,5,3]]}
["Mechanical Fan System Power Allowance",null,null,null,null,"MECH-FANSYS"]
[{"$f":"ReadMe!A2","v":"2015 Washington State Energy Code Compliance Forms for Commercial Buildings including R2 & R3 over 3 stories and all R1 "},null,null,null,null,{"$f":"ReadMe!B3","v":"Revised January 2017"}]
["Project Title:",{"$f":"IF('MECH-SUM'!D3=\"1 - This title will copy onto other forms\",\"Fill this line out on MECH-SUM\",IF('MECH-SUM'!D3=0,\"\",'MECH-SUM'!D3))","v":"Fill this line out on MECH-SUM"},null,null,{"$f":"'MECH-SUM'!H3","v":"2015-01-01"}]
[null,null,null,null,"For Building Dept. Use"]
["Fan System ID"]
["System Supply Fan Speed Control "]
["Compliance Option ",null,null,null,null,null,null,null,null,"i``","i","i`"]
["Fan System Supply CFM Total",{"$f":"SUMIF(B11:B15,\"*Supply*\",D11:D15)","v":0}]
{"$rows_left_out":107}
{"sheet":"MECH-FANSYS-DOC","index":12,"n_rows":27,"n_cols":4,"rows_kept":27,"cut":false,"hidden":false,"merged":[[3,1,3,2],[4,1,4,2],[6,1,6,2],[21,1,21,2]]}
["Fan Power Allowance Adjustment Factors ",null,null,"MECH-FANSYS-DOC"]
[{"$f":"ReadMe!A2","v":"2015 Washington State Energy Code Compliance Forms for Commercial Buildings including R2 & R3 over 3 stories and all R1 "},null,null,{"$f":"ReadMe!B3","v":"Revised January 2017"}]
[]
[null,"TABLE C403.2.11.1(2)"]
[null,"FAN POWER LIMITATION PRESSURE DROP ADJUSTMENT"]
[null,"Device","Adjustment"]
[null,"Credits"]
[null,"Fully ducted return and/or exhaust air systems","0.5 inch w.c. (2.15 inches w.c. for laboratory and vivarium systems)"]
{"$rows_left_out":20}
{"sheet":"MECH-LOAD-CALC","index":13,"n_rows":8,"n_cols":6,"rows_kept":8,"cut":false,"hidden":false,"merged":[[6,3,6,4],[3,3,3,4],[4,3,4,4],[5,3,5,4]]}
["Design Load Calculation Summary",null,null,null,null,"MECH-LOAD-CALC"]
[{"$f":"ReadMe!A2","v":"2015 Washington State Energy Code Compliance Forms for Commercial Buildings including R2 & R3 over 3 stories and all R1 "}]
["Project Title:",null,{"$f":"IF('MECH-SUM'!D3=\"1 - This title will copy onto other forms\",\"Fill this line out on MECH-SUM\",IF('MECH-SUM'!D3=0,\"\",'MECH-SUM'!D3))","v":"Fill this line out on MECH-SUM"},null,null,{"$f":"'MECH-SUM'!H3","v":"2015-01-01"}]
[null,null,null,null,null,"For Building Dept. Use"]
[]
[]
[]
["Equip. ID","Area(s) Served","Heating Design Load  in Btu/h (Note 1)","Cooling Design Load in Btu/h (Note 1)","Calculation Method\n(Note 2)","Notes"]
{"$rows_left_out":1}
{"sheet":"MECH-EQ","index":14,"n_rows":147,"n_cols":36,"rows_kept":147,"cut":false,"hidden":true,"merged":[[3,14,3,17],[4,14,4,17],[8,0,8,2],[5,3,5,5],[6,3,6,5],[7,3,7,5],[5,14,5,17],[6,14,6,17],[7,14,7,17],[8,12,8,16],[8,17,8,20],[80,3,80,8],[47,3,47,4],[46,3,46,6],[8,3,8,8],[2,7,2,9],[3,3,3,5],[4,3,4,5],[2,2,2,5]]}
["Cooling & Heating Equipment Schedule, Page 1",null,null,null,null,null,null,null,null,"MECH-EQ",null,"Cooling & Heating Equipment Schedule, Page 2",null,null,null,null,null,null,null,null,{"$f":"J1","v":"MECH-EQ"}]
[{"$f":"ReadMe!A2","v":"2015 Washington State Energy Code Compliance Forms for Commercial Buildings including R2 & R3 over 3 stories and all R1 "},null,null,null,null,null,null,null,null,{"$f":"ReadMe!B3","v":"Revised January 2017"},null,{"$f":"A2","v":"2015 Washington State Energy Code Compliance Forms for Commercial Buildings including R2 & R3 over 3 stories and all R1 "},null,null,null,null,null,null,null,null,{"$f":"J2","v":"Revised January 2017"}]
["Project Title:",null,{"$f":"IF('MECH-SUM'!D3=\"1 - This title will copy onto other forms\",\"Fill this line out on MECH-SUM\",IF('MECH-SUM'!D3=0,\"\",'MECH-SUM'!D3))","v":"Fill this line out on MECH-SUM"},null,null,null,null,{"$f":"'MECH-SUM'!H3","v":"2015-01-01"},null,null,null,"Project Title:",null,{"$f":"D3","v":0},null,null,null,null,null,null,{"$f":"H3","v":"2015-01-01"}]
[null,null,null,null,null,null,"For Building Dept. Use",null,null,null,null,null,null,null,{"$f":"D4","v":0},null,null,null,"For Building Dept. Use"]
[null,null,null,null,null,null,null,null,null,null,null,null,null,null,0]
[null,null,null,null,null,null,null,null,null,null,null,null,null,null,0]
[null,null,null,null,null,null,null,null,null,null,null,null,null,null,0]
[null,null,null,null,null,null,null,null,null,null,null,null,null,null,0]
{"$rows_left_out":140}
{"sheet":"MECH-EQ BOILER-CHILLER","index":15,"n_rows":74,"n_cols":9,"rows_kept":74,"cut":false,"hidden":true,"merged":[[2,2,2,5],[18,0,18,8],[7,0,7,7],[3,3,3,5],[4,3,4,5],[5,3,5,5]]}
["Boiler and Chiller Equipment Schedule",null,null,null,null,null,null,null,"MECH-EQ"]
[{"$f":"ReadMe!A2","v":"2015 Washington State Energy Code Compliance Forms for Commercial Buildings including R2 & R3 over 3 stories and all R1 "},null,null,null,null,null,null,null,{"$f":"ReadMe!B3","v":"Revised January 2017"}]
["Project Title:",null,{"$f":"IF('MECH-SUM'!D3=\"1 - This title will copy onto other forms\",\"Fill this line out on MECH-SUM\",IF('MECH-SUM'!D3=0,\"\",'MECH-SUM'!D3))","v":"Fill this line out on MECH-SUM"},null,null,null,{"$f":"'MECH-SUM'!H3","v":"2015-01-01"}]
[null,null,null,null,null,null,"For Building Dept. Use"]
[]
[]
[]
["Boilers"]
{"$rows_left_out":67}
{"sheet":"MECH-EQ HEAT REJECTION","index":16,"n_rows":44,"n_cols":17,"rows_kept":44,"cut":false,"hidden":true,"merged":[[26,2,26,3],[27,2,27,3],[28,2,28,3],[8,4,9,4],[19,4,20,4],[21,2,21,3],[22,2,22,3],[23,2,23,3],[24,2,24,3],[25,2,25,3],[10,2,10,3],[11,2,11,3],[12,2,12,3],[13,2,13,3],[14,2,14,3],[18,0,18,8],[19,0,20,0],[19,1,20,1],[19,5,19,8],[19,2,20,3],[2,5,2,8],[7,0,7,8],[8,0,9,0],[8,1,9,1],[8,5,8,8],[3,3,3,4],[4,3,4,4],[5,3,5,4],[8,2,9,3]]}
["Heat Rejection Equipment Schedule",null,null,null,null,null,null,null,"MECH-EQ"]
[{"$f":"ReadMe!A2","v":"2015 Washington State Energy Code Compliance Forms for Commercial Buildings including R2 & R3 over 3 stories and all R1 "},null,null,null,null,null,null,null,{"$f":"ReadMe!B3","v":"Revised January 2017"}]
["Project Title:",null,{"$f":"IF('MECH-SUM'!D3=\"1 - This title will copy onto other forms\",\"Fill this line out on MECH-SUM\",IF('MECH-SUM'!D3=0,\"\",'MECH-SUM'!D3))","v":"Fill this line out on MECH-SUM"},null,null,{"$f":"'MECH-SUM'!H3","v":"2015-01-01"}]
[null,null,null,null,null,"For Building Dept. Use"]
[]
[]
[]
["Open and Closed Circuit Cooling Towers (Water Cooled Heat Rejection Equipment)"]
{"$rows_left_out":37}
{"sheet":"MECH-EQ AIR SYSTEM TERMINALS","index":17,"n_rows":60,"n_cols":6,"rows_kept":60,"cut":false,"hidden":true,"merged":[[6,0,7,0],[6,1,7,1],[6,2,7,2],[6,3,6,4],[3,3,3,4],[4,3,4,4],[5,3,5,4]]}
["Multiple Zone Air System Terminal Schedule",null,null,null,null,"MECH-EQ"]
[{"$f":"ReadMe!A2","v":"2015 Washington State Energy Code Compliance Forms for Commercial Buildings including R2 & R3 over 3 stories and all R1 "}]
["Project Title:",null,{"$f":"IF('MECH-SUM'!D3=\"1 - This title will copy onto other forms\",\"Fill this line out on MECH-SUM\",IF('MECH-SUM'!D3=0,\"\",'MECH-SUM'!D3))","v":"Fill this line out on MECH-SUM"},null,null,{"$f":"'MECH-SUM'!H3","v":"2015-01-01"}]
[null,null,null,null,null,"For Building Dept. Use"]
[]
[]
["Equip.\nID","Maximum Airflow (cfm)","Maximum Airflow During Reheating or Recooling (cfm)","Ventilation (Note 1)"]
[null,null,null,"Ventilation Standard","Mininum \nAirflow (cfm)","Basis of Compliance (Note 2)"]
{"$rows_left_out":52}