{"text_format":"1","workbook":"xlsx","n_sheets":10,"sheets":["ReadMe","ENV-SUM","ENV-REQUIREMENTS","ENV-PRESCRIPTIVE","ENV-UA","Target Area Adjustments","TA1","ENV-SHGC","ENV-CHK","temp"],"not_rendered":{"charts":0,"images":4,"macros":1,"external_links":0,"defined_names":87,"comments":1,"pivot_tables":0},"unopened":[],"bounds":{"document_bytes":16777216,"sheet_cells":100000,"rows_first":2000,"rows_last":500,"rows_between":2000,"halvings":0,"cell_chars":16384,"cell_head_chars":4096},"cells_cut":0,"cells_raw":0,"read":"whole","date_system":"1900"}

{"sheet":"ReadMe","index":0,"n_rows":41,"n_cols":2,"rows_kept":41,"cut":false,"hidden":false,"merged":[[1,0,1,1],[5,0,6,0],[9,0,10,0],[13,0,19,0],[40,0,40,1],[27,0,27,1],[29,0,30,0],[31,0,32,0],[34,0,37,0],[38,0,39,0]]}
["Instructions for Electronic Forms, pg 1"]
["2012 Washington State Energy Code Compliance Forms for Commercial Buildings including R2 & R3 over 3 stories and all R1 "]
[null,"Revised Oct 2013"]
[null,"     Commercial Provision Chapters 1 - 5 of the 2012 Washington State Energy Code apply to all commercial occupancies, R-2 and R-3 occupancies greater than 3 stories above grade, and R-1 occupancy (all building heights)."]
["Intro","     This file, ENV12-v3.XLSM, has electronic compliance forms for envelope provisions as defined in Sections C101, C303, C402 and Appendix A for Climate Zones 4c and 5b. There are two companion files: LTG12-v3.XLSM (Section C405 lighting, motor, and transformer requirements), and MECH12-v3.XLSM (Section C403 mechanical systems requirements). "]
["Energy Code ","    This form is a compliance aid and is not a substitute for the full energy code text or specific jurisdiction compliance requirements. Users should refer to the code text and contact the local jurisdiction for complete information. The full 2012 WSEC code text is available for download from the NEEC website:"]
[null,"http:/www.neec.net/energy-codes"]
["Training ","Refer to the NEEC website for instruction on how to complete all of the 2012 WSEC Compliance Forms."]
["Start-up","Select this file from the NEEC website to download to your computer.  When opening the file be sure to Enable Macros. "]
["Overview ","     This file is an Excel workbook that contains multiple compliance forms and resources in Excel worksheets. Each worksheet is indicated by a tab at the bottom of the screen. You may visit each worksheet by selecting it's tab.  "]
[null,"     Most calculations are automated. Cells that display informational text and the results of calculations are write-protected and cannot be edited. "]
["Save Files ","This file is saved in the same manner as any standard Excel file.   "]
["Getting Around","     Some forms have two pages. Both pages are available on screen when you select the tab for a form (worksheet). Use the scroll bars to find the second page located below the first page."]
["Input Cells ","     All general project information and the date are entered once on ENV-SUM. This information is automatically replicated on all other ENV forms. The ENV-SUM form accompanies all other ENV forms."]
[null,"     Only input cells are accessible. If you try to edit a write-protected cell an error message will appear requesting a password.  A password IS NOT required to complete these forms. You may use the TAB key to move to the next input cell. If the TAB doesn't take you where you want to go, use your mouse to move around the form. "]
[null,"     Avoid excessively long text strings when entering information. In some cases, text that extends beyond the available space will not be visible. In most cases the text will wrap within the cell. This may force part of the form onto a new page."]
[null,"     To enter the date, use this format: mm/dd/yyyy.  For example, you would enter 7/1/2013 or 12/21/2014."]
[null,"     Check boxes can be checked or unchecked by clicking in the box with your mouse. Radio buttons (circles) allow only one in a set to be selected."]
[null,"     Drop-down lists have an arrow at the right side of the cell. Click on the arrow with your mouse and select the appropriate option. Use the delete button on your computer to clear a drop-down entry."]
[null,"     When a form has a space for notes or explanation, click anywhere in the space to edit. "]
{"$rows_left_out":22}
{"sheet":"ENV-SUM","index":1,"n_rows":34,"n_cols":7,"rows_kept":34,"cut":false,"hidden":false,"merged":[[27,0,28,1],[27,2,28,6],[20,3,20,6],[21,3,21,6],[20,0,21,1],[23,0,23,1],[25,0,25,1]]}
["Envelope Summary",null,null,null,{"$f":"'TA1'!$C$101","v":" "},null,"ENV-SUM"]
[{"$f":"ReadMe!A2","v":"2012 Washington State Energy Code Compliance Forms for Commercial Buildings including R2 & R3 over 3 stories and all R1 "},null,null,null,null,null,{"$f":"ReadMe!B3","v":"Revised Oct 2013"}]
["Project Info","Project Address","1 - This address line will copy onto other forms",null,null,"Date","2013-05-21"]
[null,null,null,null,null,"For Building Department Use"]
[]
[null,"Applicant Name:"]
[null,"Applicant Address:"]
[null,"Applicant Phone:"]
[]
["Project Description"]
[]
["Compliance Path"]
[]
["Occupancy Group"]
[]
[null,null,"Total Vertical Fenestration\n(rough opening)","divided by","Gross Exterior Above Grade\nWall Area","\ntimes 100 equals","\n% Vertical Fenestration"]
[null,null,null,"¸",null,"X 100 =",{"$f":"IF(C17=\"Path?\",\"Path?\",IF(E17>0,C17/E17,\"\"))","v":""}]
[null,null,"Total Skylight","divided by","Gross Exterior Roof Area","\ntimes 100 equals","\n% Skylight"]
[null,null,null,"¸",null,"X 100 =",{"$f":"IF(C19=\"Path?\",\"Path?\",IF(E19>0,C19/E19,\"\"))","v":""}]
[]
{"$rows_left_out":15}
{"sheet":"ENV-REQUIREMENTS","index":2,"n_rows":72,"n_cols":6,"rows_kept":72,"cut":false,"hidden":false,"merged":[[11,0,11,1],[4,2,4,3],[4,4,4,5],[6,0,6,1],[6,2,6,5],[7,0,7,1],[27,0,27,1],[16,0,16,1],[16,2,16,3],[16,4,16,5],[17,0,17,1],[21,0,21,1],[22,2,22,3],[23,2,23,3],[24,0,24,1],[24,2,24,5],[25,2,25,3],[26,4,26,5],[27,2,27,3],[27,4,27,5],[28,0,28,1],[28,2,28,5],[29,2,29,5],[34,0,34,1],[36,0,36,1],[40,0,40,5],[36,2,36,5],[38,0,38,1],[38,2,38,3],[38,4,38,5],[51,2,51,3],[41,2,41,3],[42,2,42,3],[43,2,43,3],[44,2,44,3],[54,0,54,1],[59,0,59,1],[71,0,71,5],[37,2,37,3],[37,4,37,5],[39,0,39,1],[39,2,39,3],[39,4,39,5],[47,2,47,3],[48,2,48,3],[49,2,49,3],[50,2,50,3],[41,4,45,5],[45,2,45,3],[46,0,46,5],[47,4,51,5]]}
["Envelope Requirements Summary, pg 1",null,null,null,{"$f":"'TA1'!$C$101","v":" "},"ENV-REQ"]
[{"$f":"ReadMe!A2","v":"2012 Washington State Energy Code Compliance Forms for Commercial Buildings including R2 & R3 over 3 stories and all R1 "},null,null,null,null,{"$f":"ReadMe!B3","v":"Revised Oct 2013"}]
["Minimum Requirements"]
["for Prescriptive Compliance"]
[null,"Prescriptive Path"," Table C402.2 Notes 1,7\nInsulation Minimum R-Value",null,"Table C402.1.2 Notes 1,2\nAssembly Maximum U-factor"]
[null,"Occupancy Group  ","All Other","Group R","All Other","Group R"]
["Opaque Elements"]
["Roofs"]
[null,"Insulation Entirely above Deck","R-30 c.i.","R-38 c.i.","U-0.034","U-0.031"]
[null,"Metal Building (with R-3.5 thermal blocks) Note 3","R-25 + R-11 Ls","R-25 + R-11 Ls","U-0.031","U-0.031"]
[null,"Attic and Other","R-49","R-49","U-0.021","U-0.021"]
["Walls, Above-grade"]
[null,"Mass","R-9.5 c.i.","R-13.3 c.i.","U-0.104 Note 6","U-0.078"]
[null,"Metal Building","R-13 + R-13 c.i.","R-13 + R-13 c.i.","U-0.052","U-0.052"]
[null,"Steel Framed","R-13 + R-10c.i.","R-19 + R-8.5 c.i.","U-0.055","U-0.055"]
[null,"Wood Framed and Other","R-21 int","R-21 int","U-0.054","U-0.054"]
["Below Grade Wall Note 4",null,"Same as above grade",null,"Same as above grade"]
["Floors"]
[null,"Mass","R-30 c.i.","R-30 c.i.","U-0.031","U-0.031"]
[null,"Steel Joist","R-38 + R-10 c.i.","R-38 + R-10 c.i.","U-0.029","U-0.029"]
{"$rows_left_out":53}
{"sheet":"ENV-PRESCRIPTIVE","index":3,"n_rows":101,"n_cols":13,"rows_kept":101,"cut":false,"hidden":false,"merged":[[10,3,10,4],[11,3,11,4],[12,3,12,4],[13,3,13,4],[14,3,14,4],[15,3,15,4],[25,3,25,4],[26,3,26,4],[27,3,27,4],[16,3,16,4],[17,3,17,4],[18,3,18,4],[19,3,19,4],[20,3,20,4],[21,3,21,4],[8,5,8,7],[8,8,8,10],[9,9,9,10],[10,9,10,10],[11,9,11,10],[12,9,12,10],[13,9,13,10],[40,3,40,4],[41,3,41,4],[34,3,34,4],[35,3,35,4],[36,3,36,4],[37,3,37,4],[38,3,38,4],[39,3,39,4],[28,3,28,4],[29,3,29,4],[30,3,30,4],[31,3,31,4],[32,3,32,4],[33,3,33,4],[22,3,22,4],[23,3,23,4],[24,3,24,4],[20,9,20,10],[21,9,21,10],[22,9,22,10],[23,9,23,10],[24,9,24,10],[25,9,25,10],[14,9,14,10],[15,9,15,10],[16,9,16,10],[17,9,17,10],[18,9,18,10],[19,9,19,10],[32,9,32,10],[33,9,33,10],[34,9,34,10],[35,9,35,10],[36,9,36,10],[37,9,37,10],[26,9,26,10],[27,9,27,10],[28,9,28,10],[29,9,29,10],[30,9,30,10],[31,9,31,10],[44,9,44,10],[45,9,45,10],[46,9,46,10],[47,9,47,10],[60,3,60,4],[38,9,38,10],[39,9,39,10],[40,9,40,10],[41,9,41,10],[42,9,42,10],[43,9,43,10],[46,3,46,4],[47,3,47,4],[42,3,42,4],[43,3,43,4],[44,3,44,4],[45,3,45,4],[58,5,58,7],[58,8,58,10],[59,9,59,10],[60,9,60,10],[79,9,79,10],[80,9,80,10],[81,9,81,10],[70,9,70,10],[71,9,71,10],[72,9,72,10],[73,9,73,10],[74,9,74,10],[75,9,75,10],[61,9,61,10],[99,8,99,10],[100,8,100,10],[101,8,101,10],[92,0,92,2],[93,0,93,2],[94,0,94,2],[95,0,95,2],[96,0,96,2],[92,8,92,10],[93,8,93,10],[94,8,94,10],[95,8,95,10],[96,8,96,10],[96,5,96,7],[97,5,97,7],[98,5,98,7],[99,5,99,7],[100,5,100,7],[101,5,101,7],[97,0,97,2],[98,0,98,2],[97,8,97,10],[98,8,98,10],[88,9,88,10],[85,9,85,10],[86,9,86,10],[87,9,87,10],[88,3,88,4],[62,9,62,10],[63,9,63,10],[64,9,64,10],[65,9,65,10],[69,9,69,10],[82,3,82,4],[83,3,83,4],[84,3,84,4],[85,3,85,4],[66,9,66,10],[68,9,68,10],[67,8,67,10],[82,9,82,10],[83,9,83,10],[84,9,84,10],[76,9,76,10],[77,9,77,10],[79,3,79,4],[78,9,78,10],[61,3,61,4],[62,3,62,4],[63,3,63,4],[64,3,64,4],[91,0,91,5],[65,3,65,4],[69,3,69,4],[81,3,81,4],[70,3,70,4],[71,3,71,4],[67,5,67,7],[80,3,80,4],[86,3,86,4],[100,0,100,2],[92,5,92,7],[93,5,93,7],[94,5,94,7],[95,5,95,7],[72,3,72,4],[73,3,73,4],[74,3,74,4],[75,3,75,4],[98,3,98,4],[99,3,99,4],[100,3,100,4],[92,3,92,4],[93,3,93,4],[94,3,94,4],[95,3,95,4],[96,3,96,4],[97,3,97,4],[87,3,87,4],[76,3,76,4],[77,3,77,4],[78,3,78,4],[99,0,99,2]]}
["Prescriptive Path, pg. 1",null,null,null,null,null,{"$f":"'TA1'!$C$101","v":" "},null,null,null,"ENV-PRESCRIPTIVE"]
[{"$f":"'ENV-SUM'!A2","v":"2012 Washington State Energy Code Compliance Forms for Commercial Buildings including R2 & R3 over 3 stories and all R1 "},null,null,null,null,null,null,null,null,null,{"$f":"'ENV-SUM'!G2","v":"Revised Oct 2013"}]
[{"$f":"'ENV-SUM'!B3","v":"Project Address"},null,null,null,{"$f":"IF('ENV-SUM'!$C$3=\"1 - This address line will copy onto other forms\",\"1 - Fill this line out on ENV-SUM\",'ENV-SUM'!$C$3)","v":"1 - Fill this line out on ENV-SUM"},null,null,null,"Date",{"$f":"TEXT('ENV-SUM'!$G$3,\"mm/dd/yyyy\")","v":"05/21/2013"}]
["Occupancy Group",null,null,null,null,null,null,null,"For Building Department Use"]
["Fenestration Area as % gross above-grade wall area",null,null,null,null,{"$f":"IF('ENV-SUM'!G17>0,'ENV-SUM'!G17,0)","v":""},"Max. Target:",{"$f":"'TA1'!D15","v":0}]
["Skylight Area as % gross roof area",null,null,null,null,{"$f":"IF('ENV-SUM'!G19>0,'ENV-SUM'!G19,0)","v":""},"Max. Target:",{"$f":"'TA1'!D64","v":0}]
["Vertical Fenestration Alternates:",null,null,null,null,{"$f":"'TA1'!B95","v":"None Selected on ENV-SUM"}]
[]
["Building Component ",null,null,null,null,"R-Value for Prescriptive Compliance",null,null,"U-Factor/F-Factor for Alternative Prescriptive Compliance"]
[null,null,null,"Provide page/plan # of assembly detail and ID.",null,"Cavity Ins.\nR-Value","Continuous Ins. (CI)\nR-Value","Alternate CI \nR-Value                               (Table C402.2 Footnote F)1","Assembly \nU-Factor","U-Factor Source                                                        (Appendix A, Chapter 3 table, or approved calculation method) "]
[null,null,"ID:"]
[null,null,"ID:"]
[null,null,"ID:",null,null,null,null,null,null,null,null,null,0]
[null,null,"ID:"]
[null,null,"ID:"]
[null,null,"ID:"]
[null,null,"ID:"]
[null,null,"ID:"]
[null,null,"ID:"]
[null,null,"ID:"]
{"$rows_left_out":82}
{"sheet":"ENV-UA","index":4,"n_rows":95,"n_cols":13,"rows_kept":95,"cut":false,"hidden":false,"merged":[]}
["Component Performance Path, pg. 1",null,null,null,null,null,null,null,null,{"$f":"'TA1'!$C$101","v":" "},null,"ENV-UA"]
[{"$f":"'ENV-SUM'!A2","v":"2012 Washington State Energy Code Compliance Forms for Commercial Buildings including R2 & R3 over 3 stories and all R1 "},null,null,null,null,null,null,null,null,null,null,{"$f":"'ENV-SUM'!G2","v":"Revised Oct 2013"}]
[{"$f":"'ENV-SUM'!B3","v":"Project Address"},null,null,null,null,{"$f":"IF('ENV-SUM'!$C$3=\"1 - This address line will copy onto other forms\",\"1 - Fill this line out on ENV-SUM\",'ENV-SUM'!$C$3)","v":"1 - Fill this line out on ENV-SUM"},null,null,null,"Date",{"$f":"TEXT('ENV-SUM'!$G$3,\"mm/dd/yyyy\")","v":"05/21/2013"}]
["Occupancy Group",null,null,null,null,null,null,null,null,"For Building Department Use"]
["Change in occupancy or space conditioning"]
["Fenestration Area as % gross above-grade wall area",null,null,null,null,null,{"$f":"IF('ENV-SUM'!G17>0,'ENV-SUM'!G17,0)","v":""},"Max. Target:",{"$f":"'TA1'!D15","v":0}]
["Skylight Area as % gross roof area",null,null,null,null,null,{"$f":"IF('ENV-SUM'!G19>0,'ENV-SUM'!G19,0)","v":""},"Max. Target:",{"$f":"'TA1'!D64","v":0}]
["Vertical  Fenestration Alternates:",null,null,null,null,null,{"$f":"'TA1'!B95","v":"None Selected on ENV-SUM"}]
[]
["Building Component ",null,null,null,null,null,null,"Proposed UA",null,"Target UA"]
[null,"Provide source of U-factor, page/plan # of assembly detail & ID",null,null,null,null,"U-factor","x Area (A)","= UA (U x A)","U-factor","x Area (A) =","UA (U x A)"]
[null,null,"R=",null,"ID:",null,null,null,{"$f":"IF(AND(G12=0,H12=0),0,IF(OR(G12=0,H12=0),NA(), H12*G12))","v":0},{"$f":"'TA1'!U92","v":"set occ."},{"$f":"'TA1'!J81","v":0},{"$f":"IF(TYPE(J12*K12)<>1,0,J12*K12)","v":0}]
[null,null,"R=",null,"ID:",null,null,null,0,"Above Deck Insulation",null,{"$f":"'TA1'!U122","v":"set occ."}]
[null,null,"R=",null,"ID:",null,null,null,0,null,null,null,0]
[null,null,"R=",null,"ID:",null,null,null,0,{"$f":"'TA1'!U93","v":"set occ."},{"$f":"'TA1'!J82","v":0},{"$f":"IF(TYPE(J15*K15)<>1,0,J15*K15)","v":0}]
[null,null,"R=",null,"ID:",null,null,null,0,"Metal Building",null,{"$f":"'TA1'!U123","v":"set occ."}]
[null,null,"R=",null,"ID:",null,null,null,0]
[null,null,"R=",null,"ID:",null,null,null,0,{"$f":"'TA1'!U94","v":"set occ."},{"$f":"'TA1'!J83","v":0},{"$f":"IF(TYPE(J18*K18)<>1,0,J18*K18)","v":0}]
[null,null,"R=",null,"ID:",null,null,null,0,"Single raft, attic, other",null,{"$f":"'TA1'!U124","v":"set occ."}]
[null,null,"R=",null,"ID:",null,null,null,0]
{"$rows_left_out":76}
{"sheet":"Target Area Adjustments","index":5,"n_rows":46,"n_cols":1,"rows_kept":46,"cut":false,"hidden":false,"merged":[]}
["Vertical Fenestration Target Area Adjustment Calculations  "]
[]
[]
[]
[]
[]
[]
[]
[]
[]
[]
[]
[]
[]
[]
[]
[]
[]
[]
[]
{"$rows_left_out":27}
{"sheet":"TA1","index":6,"n_rows":138,"n_cols":55,"rows_kept":138,"cut":false,"hidden":true,"merged":[[65,9,66,9]]}
[]
[]
[null,"Vertical Fenestration Target Area Adjustment Calculations"]
[]
[]
[]
[null,null,"VF = Vertical fenestration",null,null,null,"NW = Net above grade wall (excludes fenestration and doors.)"]
[null,null,"DR = Opaque doors",null,null,null,"Gross Exterior Above-Grade Wall Area= VF + NW + DR"]
[null,null,"AG = Above-grade"]
[]
[null,"Proposed Areas"]
[null,null,null,"Vertical Fenestration ->","VF=",{"$f":"SUM('ENV-UA'!H69:H84)","v":0}]
[null,null,null,"Opaque ->","NW=",{"$f":"SUM('ENV-UA'!H21:H32)","v":0},"DR=",{"$f":"SUM('ENV-UA'!H63:H68)","v":0}]
[null,"Gross Exterior AG Wall Area",null,"Max Vert. Fen. %\n(C402.3.1)",null,null,null,"Maximum Target Vert. Fen. Area"]
[null,{"$f":"(SUM(F12:H13))","v":0},"x",{"$f":"U109","v":0},"¸",100,"=",{"$f":"B15*D15","v":0}]
[]
[]
[null,"Total Vertical Fenestration",null,null,null,"Delta Vertical Fenestration ",null,"0",null,"Excess Vertical Fenestration"]
[null,{"$f":"F12","v":0},"-",{"$f":"H15","v":0},"=",{"$f":"B19-D19","v":0},null,"ô greater","=",{"$f":"MAX(0,H20)","v":0}]
[null,null,null,null,null,null,null,{"$f":"F19","v":0}]
{"$rows_left_out":119}
{"sheet":"ENV-SHGC","index":7,"n_rows":51,"n_cols":13,"rows_kept":51,"cut":false,"hidden":false,"merged":[[19,6,20,6],[35,6,36,6],[10,1,10,3],[11,1,11,3],[12,1,12,3],[13,1,13,3],[14,1,14,3]]}
["SHGC Calculation",null,null,null,null,null,{"$f":"'TA1'!$C$101","v":" "},null,null,"ENV-SHGC"]
[{"$f":"'ENV-SUM'!A2","v":"2012 Washington State Energy Code Compliance Forms for Commercial Buildings including R2 & R3 over 3 stories and all R1 "},null,null,null,null,null,null,null,null,{"$f":"'ENV-SUM'!G2","v":"Revised Oct 2013"}]
[{"$f":"'ENV-SUM'!B3","v":"Project Address"},null,{"$f":"IF('ENV-SUM'!$C$3=\"1 - This address line will copy onto other forms\",\"1 - Fill this line out on ENV-SUM\",'ENV-SUM'!$C$3)","v":"1 - Fill this line out on ENV-SUM"},null,null,null,null,"Date",{"$f":"TEXT('ENV-SUM'!$G$3,\"mm/dd/yyyy\")","v":"05/21/2013"}]
["Fenestration Area as % gross above-grade wall area",null,null,null,{"$f":"IF('ENV-SUM'!G17>0,'ENV-SUM'!G17,0)","v":""},null,{"$f":"'TA1'!D15","v":0},"For Building Department Use"]
["Skylight Area as % gross roof area",null,null,null,{"$f":"IF('ENV-SUM'!G19>0,'ENV-SUM'!G19,0)","v":""},null,{"$f":"'TA1'!D64","v":0}]
["Vertical  Fenestration Alternates:",null,{"$f":"'TA1'!B95","v":"None Selected on ENV-SUM"}]
[]
[]
["  Skylights",null,null,null,null,"Proposed SHGC",null,"Target SHGC"]
["Provide source of SHGC, page/plan # of assembly detail & ID",null,null,null,"SHGC","x Area (A)","= SHGC x A","SHGC","x Area (A) =","SHGC x A"]
["  ID:",null,null,null,null,null,{"$f":"IF(AND(F11=0,E11=0),0,IF(OR(F11=0,E11=0),NA(),F11*E11))","v":0},{"$f":"'TA1'!AL88","v":"set occ."},{"$f":"'TA1'!J79","v":0},{"$f":"IF(TYPE(H11*I11)<>1,0,H11*I11)","v":0}]
["  ID:",null,null,null,null,null,{"$f":"IF(AND(F12=0,E12=0),0,IF(OR(F12=0,E12=0),NA(),F12*E12))","v":0},"SHGC",null,{"$f":"'TA1'!AL117","v":"set occ."}]
["  ID:",null,null,null,null,null,0]
["  ID:",null,null,null,null,null,{"$f":"IF(AND(F14=0,E14=0),0,IF(OR(F14=0,E14=0),NA(),F14*E14))","v":0}]
["  ID:",null,null,null,null,null,0]
[null,null,null,null,"Totals",{"$f":"SUM(F10:F15)","v":0},{"$f":"SUM(G10:G15)","v":0},"Totals",{"$f":"SUM(I10:I15)","v":0},{"$f":"SUM(J10:J15)","v":0}]
[]
[null,null,null,null,null,null,null,null,null,{"$f":"IF(ABS(F16-'TA1'!F59)>0.1,IF(F16>'TA1'!F59,CONCATENATE(\"More proposed skylight area here than ENV-UA - Remove  \",TEXT('TA1'!F59-F16,\"0.0\")),CONCATENATE(\"Less proposed skylight area here than ENV-UA - Add  \",TEXT('TA1'!F59-F16,\"0.0\" )) ),\" \")","v":" "}]
[]
[" All Non-North Vertical Fenestration+",null,null,null,"Proposed SHGC",null,"PF Category","Target SHGC ++"]
{"$rows_left_out":32}
{"sheet":"ENV-CHK","index":8,"n_rows":127,"n_cols":6,"rows_kept":127,"cut":false,"hidden":false,"merged":[[14,5,15,5],[75,5,76,5],[75,4,76,4],[75,0,76,0],[75,1,76,1],[75,2,76,2],[73,0,74,0],[73,1,74,1],[73,2,74,2],[73,4,74,4],[73,5,74,5],[70,5,71,5],[70,4,71,4],[70,2,71,2],[70,1,71,1],[70,0,71,0],[68,0,69,0],[68,1,69,1],[68,2,69,2],[68,4,69,4],[68,5,69,5],[65,5,67,5],[65,4,67,4],[65,2,67,2],[65,1,67,1],[65,0,67,0],[63,0,64,0],[63,1,64,1],[63,2,64,2],[63,4,64,4],[63,5,64,5],[55,0,56,0],[55,1,56,1],[55,2,56,2],[55,4,56,4],[55,5,56,5],[52,5,54,5],[52,4,54,4],[52,2,54,2],[52,1,54,1],[52,0,54,0],[49,0,51,0],[49,1,51,1],[49,2,51,2],[49,4,51,4],[49,5,51,5],[58,0,61,0],[58,1,61,1],[58,2,61,2],[58,4,61,4],[58,5,61,5],[38,5,40,5],[38,4,40,4],[38,2,40,2],[38,1,40,1],[38,0,40,0],[35,0,37,0],[35,1,37,1],[35,2,37,2],[35,4,37,4],[35,5,37,5],[32,0,34,0],[32,1,34,1],[32,2,34,2],[32,4,34,4],[32,5,34,5],[28,0,30,0],[28,1,30,1],[28,2,30,2],[28,4,30,4],[28,5,30,5],[3,0,3,5],[86,0,86,5],[14,0,15,0],[14,1,15,1],[14,2,15,2],[14,4,15,4],[16,0,20,0],[16,1,20,1],[16,2,20,2],[16,4,20,4],[16,5,20,5],[22,0,27,0],[22,1,27,1],[22,2,27,2],[22,4,27,4],[22,5,27,5]]}
["Building Permit Plans Checklist, pg. 1",null,null,null,null,"ENV-CHK"]
[{"$f":"ReadMe!A2","v":"2012 Washington State Energy Code Compliance Forms for Commercial Buildings including R2 & R3 over 3 stories and all R1 "}]
["Project Address",null,{"$f":"IF('ENV-SUM'!$C$3=\"1 - This address line will copy onto other forms\",\"1 - Fill this line out on ENV-SUM\",'ENV-SUM'!$C$3)","v":"1 - Fill this line out on ENV-SUM"},null,"Date",{"$f":"'ENV-SUM'!G3","v":"2013-05-21"}]
["The following information is necessary to check a building permit application for compliance with the building envelope requirements in the Washington State Energy Code, Commercial Provisions."]
["Applicability (yes,no,na) ","Code Section","Component","Compliance information required in permit documents","Location in Documents","Building Department Notes"]
["SCOPE "]
[null,"C101.5.2","Low energy spaces","Low energy spaces identified on plans"]
[null,"C101.5.2.1\nC402.1.4","Semi-heated spaces","Semi-heated spaces identified on plans"]
[null,"C402.5 C402.6","Cooler and freezer spaces","Walk-in and refrigerated warehouse cooler and freezer spaces identified on plans"]
[null,"C101.4.6","Mixed occupancy","Spaces with different occupancy requirements identified on plans"]
[null,"C101.4.4 C101.4.5","Change of occupancy/space conditioning","Existing F, S and U-occupancy building spaces undergoing a change of occupancy or space conditioning that require compliance are identified on plans"]
["ENVELOPE PROVISIONS"]
[null,"C303.1","Insulation identification","Indicate identification mark shall be applied to all insulation materials"]
[null,"C303.1.3 C402.4.3","Fenestration product rating","Fenestration products shall be labeled with rated U-factor, SHGC, VT, and  leakage rating"]
[null,"C303.1.1 C402.2 ","General insulation installation","Indicate installation methods, thicknesses, densities and clearances to achieve the intended R-value of all insulation materials; "]
[null,null,null,"Where two or more layers of rigid insulation will be used, indicate that edge joints between layers are staggered"]
[null,"C402.2.1","Roof assembly insulation","Indicate R-value(s) of cavity/continuous insulation on roof sections;  "]
[null,null,null,"Indicate framing materials on roof sections; "]
[null,null,null,"Indicate method of framing for ceilings below vented attics and vaulted ceilings per A102.2 (std, adv);"]
[null,null,null,"Provide area-weighted calculations for sloped insulation installed entirely above deck;"]
{"$rows_left_out":108}
{"sheet":"temp","index":9,"n_rows":35,"n_cols":1,"rows_kept":35,"cut":false,"hidden":true,"merged":[]}
[4]
[4]
[4]
[4]
[4]
[4]
[4]
[4]
[4]
[4]
[4]
[4]
[4]
[4]
[4]
[4]
[4]
[4]
[4]
[4]
{"$rows_left_out":15}